program: Orca
programVersion: 5.0.2
elementType: S S S P P O O O O O O C C C C C C C C C C C C C C C C H H H H H H H H H H H H H H H H H H H H
charge: 0
multiplicity: 1
keywords: wb97x-d3
keywords: def2-TZVPP
keywords: def2/J RIJCOSX
keywords: DEFGRID2
keywords: scfconv7
keywords: smallprint printgap noloewdin
keywords: NOSOSCF
formula: C16H20O6P2S3
InChI: InChI=1/C16H20O6P2S3/c1-17-23(25,18-2)21-13-5-9-15(10-6-13)27-16-11-7-14(8-12-16)22-24(26,19-3)20-4/h5-12H,1-4H3
47 atoms
S  -0.330379 -3.222901 -0.974551
S  -4.840495 2.393678 -0.601011
S  4.815793 1.440242 -2.204516
P  -5.270816 1.266125 0.88286
P  5.272468 0.795095 -0.464292
O  -4.041383 0.556174 1.653509
O  4.9857 -0.767093 -0.166424
O  -6.202463 0.006689 0.594494
O  -6.011512 1.957115 2.11527
O  6.806648 0.882026 -0.038336
O  4.545378 1.473173 0.781252
C  -1.411978 -2.058331 -0.196313
C  1.244723 -2.459905 -0.716727
C  -3.186042 -0.303349 1.000918
C  3.739137 -1.316222 -0.363762
C  -1.270625 -0.685872 -0.379123
C  1.654201 -2.052068 0.549873
C  -2.45605 -2.542153 0.582754
C  2.102208 -2.304732 -1.797905
C  -2.147735 0.194728 0.228387
C  2.892159 -1.4620 0.725233
C  -3.35649 -1.665951 1.168539
C  3.357584 -1.741049 -1.623849
C  -7.218708 0.045159 -0.400927
C  -5.592014 3.222673 2.610263
C  7.839896 0.514924 -0.944563
C  4.266965 2.868069 0.810873
H  -0.466697 -0.29984 -0.991595
H  0.995437 -2.18126 1.398319
H  -2.563901 -3.607347 0.740314
H  1.783182 -2.608506 -2.786033
H  -2.035658 1.261645 0.093777
H  3.211364 -1.130758 1.704208
H  -4.170737 -2.037875 1.775589
H  4.023226 -1.610777 -2.465683
H  -6.832774 0.431022 -1.344891
H  -8.058715 0.661998 -0.078691
H  -7.559321 -0.977913 -0.538202
H  -4.659155 3.13316 3.168982
H  -5.457996 3.941413 1.800285
H  -6.373375 3.574362 3.279473
H  7.864678 -0.565559 -1.093246
H  7.71337 1.007669 -1.909658
H  8.778407 0.832092 -0.496706
H  3.584858 3.033586 1.640965
H  5.178051 3.443922 0.977451
H  3.797903 3.197777 -0.116753
totalener: -2950.71128490 hartree
nucrepener: 3303.18940394 hartree
electener: -6253.90068884 hartree
twoeener: 4383.12687280 hartree
kineticenergy: 2942.65853047 hartree
xcener: -192.768299659205 hartree
chargesum: 0.0000000
charge: -0.025483 -0.398985 -0.396706 0.723987 0.724822 -0.337329 -0.337814 -0.315328 -0.311233 -0.310754 -0.316944 0.000549 -0.011828 0.241308 0.251549 -0.111314 -0.090832 -0.109136 -0.108712 -0.151539 -0.169162 -0.164924 -0.148905 -0.120475 -0.121604 -0.123081 -0.121576 0.134193 0.128327 0.115247 0.118219 0.127919 0.125711 0.123677 0.123394 0.114668 0.114415 0.114006 0.115219 0.107508 0.116125 0.115647 0.109053 0.116647 0.113722 0.114236 0.113515
qa: -0.0255 -0.3990 -0.3967 0.7240 0.7248 -0.3373 -0.3378 -0.3153 -0.3112 -0.3108 -0.3169 0.0005 -0.0118 0.2413 0.2515 -0.1113 -0.0908 -0.1091 -0.1087 -0.1515 -0.1692 -0.1649 -0.1489 -0.1205 -0.1216 -0.1231 -0.1216 0.1342 0.1283 0.1152 0.1182 0.1279 0.1257 0.1237 0.1234 0.1147 0.1144 0.1140 0.1152 0.1075 0.1161 0.1156 0.1091 0.1166 0.1137 0.1142 0.1135
va: 2.3512 2.0421 2.0448 5.5238 5.5267 2.1243 2.1238 2.1268 2.1232 2.1218 2.1300 3.8445 3.8429 3.8056 3.8002 3.9447 3.9171 3.9668 3.9941 4.0472 4.0651 4.0841 4.0613 3.8683 3.8645 3.8653 3.8696 0.9965 0.9987 1.0186 1.0192 1.0169 1.0130 1.0126 1.0169 1.0037 0.9868 0.9915 0.9874 1.0065 0.9906 0.9876 1.0050 0.9907 0.9910 0.9872 1.0041
dispcorr: -0.022907234 hartree
energy: -2950.734192134948
dipole: -0.95027 0.96761 0.01734 6.47046 -6.12704 0.34342 4.61220 -3.58739 1.02480
magnitude: 1.08095 au
magnitude: 2.74756 debye
