program: Orca
programVersion: 5.0.2
elementType: S S S P P O O O O O O C C C C C C C C C C C C C C C C H H H H H H H H H H H H H H H H H H H H
charge: 0
multiplicity: 1
keywords: wb97x-d3
keywords: def2-TZVPP
keywords: def2/J RIJCOSX
keywords: DEFGRID2
keywords: scfconv7
keywords: smallprint printgap noloewdin
keywords: NOSOSCF
formula: C16H20O6P2S3
InChI: InChI=1/C16H20O6P2S3/c1-17-23(25,18-2)21-13-5-9-15(10-6-13)27-16-11-7-14(8-12-16)22-24(26,19-3)20-4/h5-12H,1-4H3
47 atoms
S  -0.33682 -3.166311 -1.041167
S  -4.923457 2.407193 -0.619626
S  4.863544 1.3722 -2.164195
P  -5.307613 1.27032 0.869757
P  5.304207 0.757114 -0.408609
O  -4.05364 0.583548 1.621483
O  4.996072 -0.795738 -0.085373
O  -6.21915 -0.00688 0.596397
O  -6.040969 1.949386 2.112086
O  6.836721 0.835029 0.024937
O  4.579678 1.468358 0.820314
C  -1.421736 -2.013226 -0.250115
C  1.241987 -2.428131 -0.735229
C  -3.196305 -0.269666 0.963276
C  3.74745 -1.330568 -0.312789
C  -1.32706 -0.643902 -0.480944
C  1.597693 -1.961737 0.527132
C  -2.417774 -2.499887 0.587279
C  2.158914 -2.355461 -1.776053
C  -2.202975 0.232225 0.134895
C  2.841718 -1.395251 0.735443
C  -3.319356 -1.630316 1.181416
C  3.418629 -1.814605 -1.566442
C  -7.245972 0.008818 -0.388467
C  -5.653522 3.233188 2.586166
C  7.867082 0.416601 -0.862376
C  4.304033 2.863795 0.814394
H  -0.559269 -0.257563 -1.137982
H  0.893877 -2.025755 1.346237
H  -2.486802 -3.561948 0.78185
H  1.883102 -2.703109 -2.762846
H  -2.125521 1.296946 -0.036505
H  3.118731 -1.018725 1.710826
H  -4.098164 -2.003638 1.832301
H  4.128849 -1.745525 -2.378711
H  -6.872917 0.383133 -1.341918
H  -8.087751 0.623455 -0.067376
H  -7.579433 -1.01884 -0.506435
H  -4.699277 3.183586 3.112533
H  -5.575585 3.951085 1.768485
H  -6.424443 3.557917 3.280477
H  7.867371 -0.668156 -0.978623
H  7.758787 0.883109 -1.842681
H  8.809875 0.724711 -0.417339
H  3.61984 3.0512 1.637967
H  5.21564 3.442068 0.969128
H  3.838562 3.171373 -0.122491
totalener: -2950.71123491 hartree
nucrepener: 3301.16607363 hartree
electener: -6251.87730854 hartree
twoeener: 4381.09820619 hartree
kineticenergy: 2942.65862078 hartree
xcener: -192.768327360888 hartree
chargesum: -0.0000000
charge: -0.025123 -0.399272 -0.397095 0.723128 0.725547 -0.336370 -0.338618 -0.314402 -0.311123 -0.310535 -0.318358 -0.003979 -0.008365 0.242055 0.246864 -0.109691 -0.094716 -0.107029 -0.108527 -0.148076 -0.168910 -0.165632 -0.147874 -0.120529 -0.121931 -0.123339 -0.121140 0.133587 0.128192 0.117146 0.116547 0.130199 0.126455 0.123490 0.121752 0.114760 0.114325 0.114412 0.115131 0.108561 0.116285 0.115468 0.108838 0.116662 0.113272 0.114424 0.113531
qa: -0.0251 -0.3993 -0.3971 0.7231 0.7255 -0.3364 -0.3386 -0.3144 -0.3111 -0.3105 -0.3184 -0.0040 -0.0084 0.2421 0.2469 -0.1097 -0.0947 -0.1070 -0.1085 -0.1481 -0.1689 -0.1656 -0.1479 -0.1205 -0.1219 -0.1233 -0.1211 0.1336 0.1282 0.1171 0.1165 0.1302 0.1265 0.1235 0.1218 0.1148 0.1143 0.1144 0.1151 0.1086 0.1163 0.1155 0.1088 0.1167 0.1133 0.1144 0.1135
va: 2.3512 2.0411 2.0441 5.5236 5.5264 2.1261 2.1218 2.1264 2.1234 2.1224 2.1289 3.8418 3.8455 3.8066 3.8046 3.9556 3.9118 3.9680 3.9896 4.0392 4.0657 4.0816 4.0638 3.8686 3.8644 3.8660 3.8695 0.9978 0.9977 1.0187 1.0190 1.0164 1.0132 1.0123 1.0162 1.0033 0.9868 0.9916 0.9872 1.0062 0.9906 0.9878 1.0048 0.9908 0.9910 0.9873 1.0044
dispcorr: -0.022907705 hartree
energy: -2950.734142610343
dipole: -0.98554 0.92134 -0.06420 6.29894 -5.96498 0.33396 4.61691 -3.58108 1.03583
magnitude: 1.09023 au
magnitude: 2.77113 debye
