program: Orca
programVersion: 5.0.2
elementType: S S S P P O O O O O O C C C C C C C C C C C C C C C C H H H H H H H H H H H H H H H H H H H H
charge: 0
multiplicity: 1
keywords: wb97x-d3
keywords: def2-TZVPP
keywords: def2/J RIJCOSX
keywords: DEFGRID2
keywords: scfconv7
keywords: smallprint printgap noloewdin
keywords: NOSOSCF
formula: C16H20O6P2S3
InChI: InChI=1/C16H20O6P2S3/c1-17-23(25,18-2)21-13-5-9-15(10-6-13)27-16-11-7-14(8-12-16)22-24(26,19-3)20-4/h5-12H,1-4H3
47 atoms
S  -0.022424 -2.632268 -0.4567
S  -6.922386 -0.910562 0.064383
S  6.867057 -1.037086 -0.284772
P  -6.05488 0.791937 0.035493
P  6.073358 0.625249 0.225024
O  -4.610135 0.896729 0.745932
O  4.646581 0.995691 -0.433847
O  -6.807212 1.994898 0.765719
O  -5.722383 1.421052 -1.391026
O  5.746029 0.838517 1.770406
O  6.892174 1.948286 -0.126631
C  -1.377831 -1.548395 -0.112584
C  1.355906 -1.523113 -0.425863
C  -3.568842 0.055928 0.426758
C  3.582429 0.123585 -0.40882
C  -1.535873 -0.334266 -0.774866
C  1.526632 -0.587297 0.590486
C  -2.335333 -1.955821 0.807903
C  2.319193 -1.635716 -1.421174
C  -2.624281 0.4735 -0.4992
C  2.632638 0.243604 0.594888
C  -3.442286 -1.162428 1.069614
C  3.442846 -0.823313 -1.407851
C  -7.517997 1.789943 1.980177
C  -6.613737 1.2848 -2.491536
C  6.57897 0.300436 2.790747
C  7.580593 2.07769 -1.364229
H  -0.801138 -0.014571 -1.501863
H  0.788355 -0.500032 1.376554
H  -2.213313 -2.894514 1.332082
H  2.189353 -2.356635 -2.217496
H  -2.743424 1.425047 -0.999401
H  2.761309 0.983194 1.37354
H  -4.190288 -1.479323 1.783127
H  4.195612 -0.913665 -2.178766
H  -6.833529 1.616472 2.81159
H  -8.203871 0.945947 1.900095
H  -8.082081 2.69961 2.169304
H  -7.489647 1.922148 -2.365526
H  -6.067988 1.600922 -3.377004
H  -6.936631 0.250434 -2.613854
H  6.810075 -0.748124 2.601163
H  7.509266 0.863489 2.872959
H  6.026713 0.386867 3.723069
H  8.202522 2.965586 -1.285281
H  8.210442 1.20892 -1.559612
H  6.881336 2.206121 -2.19152
totalener: -2950.71183827 hartree
nucrepener: 3238.55074151 hartree
electener: -6189.26257978 hartree
twoeener: 4318.44699132 hartree
kineticenergy: 2942.64945168 hartree
xcener: -192.766828748650 hartree
chargesum: -0.0000000
charge: -0.018596 -0.396347 -0.396939 0.721802 0.723944 -0.334839 -0.336497 -0.311698 -0.317911 -0.319398 -0.310698 -0.003418 -0.003192 0.236770 0.235952 -0.105436 -0.103420 -0.112356 -0.113260 -0.158072 -0.160911 -0.142710 -0.140666 -0.122014 -0.121718 -0.120894 -0.122768 0.130170 0.129870 0.117465 0.116779 0.127585 0.128132 0.121222 0.120175 0.113867 0.110496 0.116134 0.113712 0.113826 0.113898 0.114261 0.114176 0.113240 0.116617 0.109686 0.113984
qa: -0.0186 -0.3963 -0.3969 0.7218 0.7239 -0.3348 -0.3365 -0.3117 -0.3179 -0.3194 -0.3107 -0.0034 -0.0032 0.2368 0.2360 -0.1054 -0.1034 -0.1124 -0.1133 -0.1581 -0.1609 -0.1427 -0.1407 -0.1220 -0.1217 -0.1209 -0.1228 0.1302 0.1299 0.1175 0.1168 0.1276 0.1281 0.1212 0.1202 0.1139 0.1105 0.1161 0.1137 0.1138 0.1139 0.1143 0.1142 0.1132 0.1166 0.1097 0.1140
va: 2.3625 2.0450 2.0433 5.5288 5.5266 2.1287 2.1245 2.1171 2.1290 2.1282 2.1201 3.8446 3.8451 3.8154 3.8156 3.9267 3.9233 3.9962 3.9955 4.0608 4.0629 4.0667 4.0651 3.8660 3.8707 3.8700 3.8665 0.9969 0.9967 1.0193 1.0192 1.0129 1.0125 1.0157 1.0158 0.9873 1.0052 0.9911 0.9873 0.9910 1.0037 1.0038 0.9873 0.9912 0.9909 1.0055 0.9873
dispcorr: -0.022659107 hartree
energy: -2950.734497373484
dipole: -0.01622 0.01033 -0.00589 8.59297 -7.12607 1.46690 1.30061 -1.08768 0.21293
magnitude: 1.48229 au
magnitude: 3.76768 debye
