program: Orca
programVersion: 5.0.2
elementType: S S S P P O O O O O O C C C C C C C C C C C C C C C C H H H H H H H H H H H H H H H H H H H H
charge: 0
multiplicity: 1
keywords: wb97x-d3
keywords: def2-TZVPP
keywords: def2/J RIJCOSX
keywords: DEFGRID2
keywords: scfconv7
keywords: smallprint printgap noloewdin
keywords: NOSOSCF
formula: C16H20O6P2S3
InChI: InChI=1/C16H20O6P2S3/c1-17-23(25,18-2)21-13-5-9-15(10-6-13)27-16-11-7-14(8-12-16)22-24(26,19-3)20-4/h5-12H,1-4H3
47 atoms
S  -0.093461 -3.150287 0.4242
S  -5.049385 1.579606 2.465074
S  4.282309 2.382406 -0.343425
P  -5.544798 1.005146 0.709093
P  5.441028 0.98834 -0.940356
O  -4.361188 0.859652 -0.38051
O  5.120061 -0.508647 -0.427676
O  -6.462063 1.960108 -0.17117
O  -6.323201 -0.393805 0.640243
O  5.542109 0.73949 -2.51371
O  6.982364 1.099214 -0.542309
C  -1.321846 -1.904458 0.165223
C  1.413481 -2.260313 0.169504
C  -3.360537 -0.062099 -0.178335
C  3.869436 -1.038588 -0.250258
C  -1.232146 -0.644294 0.74955
C  1.632672 -1.496119 -0.972071
C  -2.439435 -2.230672 -0.594167
C  2.435737 -2.402385 1.099559
C  -2.245136 0.28116 0.572493
C  2.851014 -0.875051 -1.180335
C  -3.46801 -1.315066 -0.757713
C  3.664082 -1.797071 0.889154
C  -7.549897 2.657164 0.422789
C  -6.232251 -1.389726 1.652224
C  5.710346 1.83976 -3.401426
C  7.370747 1.492666 0.76791
H  -0.36679 -0.382602 1.343876
H  0.846081 -1.383191 -1.706312
H  -2.504434 -3.201394 -1.067943
H  2.270631 -2.983084 1.997388
H  -2.179583 1.261981 1.02297
H  3.008613 -0.294135 -2.07867
H  -4.336268 -1.562641 -1.353983
H  4.46208 -1.909291 1.610878
H  -7.895811 3.379464 -0.311931
H  -7.239333 3.181279 1.327698
H  -8.367438 1.976843 0.665913
H  -6.217348 -0.946788 2.648349
H  -7.10937 -2.024179 1.54945
H  -5.334263 -1.9934 1.519137
H  4.959389 2.610674 -3.222137
H  6.704169 2.277359 -3.299185
H  5.596512 1.449946 -4.409667
H  7.156004 0.706176 1.493102
H  8.443748 1.664881 0.739984
H  6.86323 2.408605 1.07367
totalener: -2950.70965273 hartree
nucrepener: 3282.50981876 hartree
electener: -6233.21947149 hartree
twoeener: 4362.30559351 hartree
kineticenergy: 2942.64684269 hartree
xcener: -192.767555620850 hartree
chargesum: 0.0000000
charge: -0.026404 -0.398571 -0.376867 0.709869 0.697495 -0.316432 -0.312401 -0.302159 -0.323748 -0.315306 -0.316564 0.001506 -0.009589 0.217016 0.226551 -0.103063 -0.112947 -0.102291 -0.113893 -0.136854 -0.108922 -0.201248 -0.151597 -0.129476 -0.104344 -0.127152 -0.121966 0.133663 0.128729 0.117914 0.116625 0.133141 0.113837 0.136560 0.118621 0.117655 0.112870 0.110633 0.112635 0.115516 0.106233 0.111018 0.117815 0.117762 0.111275 0.116444 0.110410
qa: -0.0264 -0.3986 -0.3769 0.7099 0.6975 -0.3164 -0.3124 -0.3022 -0.3237 -0.3153 -0.3166 0.0015 -0.0096 0.2170 0.2266 -0.1031 -0.1129 -0.1023 -0.1139 -0.1369 -0.1089 -0.2012 -0.1516 -0.1295 -0.1043 -0.1272 -0.1220 0.1337 0.1287 0.1179 0.1166 0.1331 0.1138 0.1366 0.1186 0.1177 0.1129 0.1106 0.1126 0.1155 0.1062 0.1110 0.1178 0.1178 0.1113 0.1164 0.1104
va: 2.3548 2.0405 2.0588 5.5384 5.5334 2.1409 2.1514 2.1454 2.0849 2.1053 2.1211 3.8483 3.8553 3.8117 3.8513 3.9425 3.9918 3.9382 3.9974 4.0431 3.9699 4.0103 4.0366 3.8702 3.8520 3.8600 3.8681 0.9965 0.9995 1.0184 1.0193 1.0105 1.0227 1.0070 1.0104 0.9915 1.0043 0.9872 1.0131 0.9899 0.9824 1.0044 0.9908 0.9905 0.9878 0.9908 1.0052
dispcorr: -0.023451380 hartree
energy: -2950.733104111742
dipole: -0.64202 0.86840 0.22639 1.56049 -1.77754 -0.21705 -0.69282 0.30744 -0.38537
magnitude: 0.49686 au
magnitude: 1.26292 debye
