program: Orca
programVersion: 5.0.2
elementType: S S S P P O O O O O O C C C C C C C C C C C C C C C C H H H H H H H H H H H H H H H H H H H H
charge: 0
multiplicity: 1
keywords: wb97x-d3
keywords: def2-TZVPP
keywords: def2/J RIJCOSX
keywords: DEFGRID2
keywords: scfconv7
keywords: smallprint printgap noloewdin
keywords: NOSOSCF
formula: C16H20O6P2S3
InChI: InChI=1/C16H20O6P2S3/c1-17-23(25,18-2)21-13-5-9-15(10-6-13)27-16-11-7-14(8-12-16)22-24(26,19-3)20-4/h5-12H,1-4H3
47 atoms
S  0.09085 -2.580435 1.101047
S  -5.40076 2.22364 1.470532
S  6.905351 -0.450522 0.341498
P  -5.939225 0.796665 0.314932
P  5.92616 0.642921 -0.88379
O  -4.825929 0.182629 -0.677586
O  4.447952 1.109042 -0.430174
O  -7.092693 1.130936 -0.73488
O  -6.484653 -0.534404 0.998836
O  6.555236 2.062386 -1.246532
O  5.621779 0.03644 -2.326319
C  -1.3525 -1.703415 0.574152
C  1.390256 -1.482062 0.617836
C  -3.685202 -0.432392 -0.212063
C  3.469044 0.205214 -0.087421
C  -2.432436 -2.445216 0.107506
C  1.487939 -0.9983 -0.684346
C  -1.457983 -0.318411 0.654453
C  2.355384 -1.130887 1.553033
C  -3.606817 -1.813006 -0.267895
C  2.518798 -0.146314 -1.035866
C  -2.616506 0.32076 0.247932
C  3.406975 -0.297528 1.20005
C  -7.161303 2.3948 -1.383796
C  -7.289455 -0.487463 2.171422
C  7.21313 2.848061 -0.260131
C  6.521348 -0.869589 -2.955833
H  -2.355551 -3.521938 0.028054
H  0.747037 -1.278334 -1.421528
H  -0.629538 0.269907 1.025614
H  2.281009 -1.500054 2.567372
H  -4.448202 -2.387296 -0.631159
H  2.58845 0.247261 -2.04092
H  -2.693042 1.398066 0.297669
H  4.159945 -0.024882 1.926344
H  -6.364307 2.501895 -2.120919
H  -7.095658 3.212869 -0.665559
H  -8.121488 2.434004 -1.892182
H  -7.369553 -1.5081 2.536596
H  -6.833594 0.138798 2.938771
H  -8.287271 -0.109232 1.945905
H  6.499866 3.258025 0.45641
H  7.96246 2.263792 0.275553
H  7.698738 3.666732 -0.785088
H  7.433397 -0.362396 -3.272376
H  6.783001 -1.692877 -2.290827
H  6.007824 -1.258499 -3.831409
totalener: -2950.71098499 hartree
nucrepener: 3246.45083883 hartree
electener: -6197.16182383 hartree
twoeener: 4326.38098225 hartree
kineticenergy: 2942.64828668 hartree
xcener: -192.767392871785 hartree
chargesum: 0.0000000
charge: -0.018201 -0.401879 -0.397830 0.722857 0.722632 -0.334187 -0.334602 -0.313253 -0.311616 -0.310006 -0.318949 0.015647 0.003942 0.230019 0.238000 -0.114385 -0.118431 -0.133104 -0.112683 -0.160226 -0.153534 -0.141317 -0.142211 -0.121782 -0.122191 -0.121844 -0.121142 0.113931 0.132613 0.132966 0.119210 0.122695 0.127363 0.130159 0.124004 0.114553 0.110375 0.115801 0.114648 0.113946 0.112830 0.114670 0.110120 0.116158 0.114608 0.115372 0.114252
qa: -0.0182 -0.4019 -0.3978 0.7229 0.7226 -0.3342 -0.3346 -0.3133 -0.3116 -0.3100 -0.3189 0.0156 0.0039 0.2300 0.2380 -0.1144 -0.1184 -0.1331 -0.1127 -0.1602 -0.1535 -0.1413 -0.1422 -0.1218 -0.1222 -0.1218 -0.1211 0.1139 0.1326 0.1330 0.1192 0.1227 0.1274 0.1302 0.1240 0.1146 0.1104 0.1158 0.1146 0.1139 0.1128 0.1147 0.1101 0.1162 0.1146 0.1154 0.1143
va: 2.3721 2.0385 2.0420 5.5232 5.5238 2.1324 2.1292 2.1179 2.1293 2.1211 2.1240 3.8495 3.8409 3.8162 3.8204 3.9673 3.9395 3.9559 4.0098 4.0852 4.0499 4.0406 4.0625 3.8656 3.8715 3.8654 3.8704 1.0176 0.9974 0.9964 1.0191 1.0122 1.0122 1.0165 1.0165 0.9867 1.0056 0.9908 0.9913 1.0034 0.9872 0.9871 1.0048 0.9910 0.9871 1.0026 0.9916
dispcorr: -0.022565816 hartree
energy: -2950.733550809370
dipole: -2.16633 1.78954 -0.37679 3.75349 -3.41653 0.33696 -4.39760 3.52395 -0.87366
magnitude: 1.00935 au
magnitude: 2.56557 debye
