program: Orca
programVersion: 5.0.2
elementType: S S S P P O O O O O O C C C C C C C C C C C C C C C C H H H H H H H H H H H H H H H H H H H H
charge: 0
multiplicity: 1
keywords: wb97x-d3
keywords: def2-TZVPP
keywords: def2/J RIJCOSX
keywords: DEFGRID2
keywords: scfconv7
keywords: smallprint printgap noloewdin
keywords: NOSOSCF
formula: C16H20O6P2S3
InChI: InChI=1/C16H20O6P2S3/c1-17-23(25,18-2)21-13-5-9-15(10-6-13)27-16-11-7-14(8-12-16)22-24(26,19-3)20-4/h5-12H,1-4H3
47 atoms
S  0.005558 -4.268704 0.006108
S  -1.671503 2.058394 2.255691
S  1.668222 2.048467 -2.271387
P  -3.14856 1.576897 1.131684
P  3.146952 1.581515 -1.143096
O  -3.747912 0.082957 1.377497
O  3.750829 0.087556 -1.375269
O  -2.922866 1.637483 -0.438423
O  -4.483266 2.428413 1.263663
O  4.478779 2.436175 -1.282494
O  2.921249 1.65469 0.426633
C  -1.231376 -3.075361 0.472661
C  1.239489 -3.072552 -0.461362
C  -2.940445 -0.994998 1.09961
C  2.944849 -0.990241 -1.093142
C  -1.219674 -2.52169 1.746726
C  1.234202 -2.528914 -1.739911
C  -2.151841 -2.623742 -0.464342
C  2.151314 -2.609172 0.478568
C  -2.067977 -1.473885 2.064503
C  2.081089 -1.480585 -2.060215
C  -3.007165 -1.57853 -0.156155
C  3.004239 -1.562679 0.168209
C  -1.627802 1.775089 -1.028964
C  -5.011036 2.757392 2.544273
C  4.996674 2.775947 -2.564046
C  1.627054 1.799831 1.017537
H  -0.518906 -2.889134 2.484396
H  0.53973 -2.904828 -2.479397
H  -2.17813 -3.07049 -1.449156
H  2.172617 -3.048188 1.467047
H  -2.03927 -1.013601 3.042366
H  2.057679 -1.028596 -3.042157
H  -3.710914 -1.20531 -0.888053
H  3.700746 -1.180532 0.902482
H  -1.790982 1.924532 -2.092507
H  -1.027763 0.877721 -0.883238
H  -1.092964 2.631815 -0.623408
H  -5.8185 3.465184 2.376187
H  -5.409652 1.874241 3.045554
H  -4.251152 3.218123 3.177244
H  5.788629 3.501511 -2.398027
H  5.413372 1.901049 -3.064808
H  4.22589 3.21932 -3.196102
H  1.029842 0.897681 0.889761
H  1.792361 1.970139 2.077728
H  1.088542 2.647199 0.596969
totalener: -2950.70607802 hartree
nucrepener: 3616.81549155 hartree
electener: -6567.52156957 hartree
twoeener: 4696.24952324 hartree
kineticenergy: 2942.66018713 hartree
xcener: -192.767047887542 hartree
chargesum: 0.0000000
charge: -0.066615 -0.423245 -0.423583 0.746904 0.746719 -0.333481 -0.332873 -0.322716 -0.305423 -0.305455 -0.322857 0.075877 0.076235 0.220952 0.222249 -0.141943 -0.141971 -0.136370 -0.136714 -0.136238 -0.135759 -0.157856 -0.159810 -0.097419 -0.130271 -0.129723 -0.096969 0.117467 0.117497 0.118380 0.118619 0.125559 0.125397 0.131709 0.132009 0.125473 0.096223 0.114390 0.118195 0.116483 0.110569 0.118046 0.116364 0.110547 0.096046 0.125485 0.113895
qa: -0.0666 -0.4232 -0.4236 0.7469 0.7467 -0.3335 -0.3329 -0.3227 -0.3054 -0.3055 -0.3229 0.0759 0.0762 0.2210 0.2222 -0.1419 -0.1420 -0.1364 -0.1367 -0.1362 -0.1358 -0.1579 -0.1598 -0.0974 -0.1303 -0.1297 -0.0970 0.1175 0.1175 0.1184 0.1186 0.1256 0.1254 0.1317 0.1320 0.1255 0.0962 0.1144 0.1182 0.1165 0.1106 0.1180 0.1164 0.1105 0.0960 0.1255 0.1139
va: 2.2194 2.0074 2.0070 5.4899 5.4901 2.1022 2.1034 2.1264 2.1521 2.1519 2.1261 3.8034 3.8030 3.8245 3.8252 4.0047 4.0046 3.9743 3.9737 4.0162 4.0166 3.9951 3.9957 3.8740 3.8741 3.8733 3.8739 1.0131 1.0134 1.0149 1.0147 1.0165 1.0164 1.0101 1.0100 0.9930 0.9818 1.0021 0.9910 0.9875 1.0009 0.9909 0.9874 1.0013 0.9819 0.9929 1.0023
dispcorr: -0.029807623 hartree
energy: -2950.735885646591
dipole: -0.03309 0.02906 -0.00403 6.44553 -6.10285 0.34268 -0.01132 0.00997 -0.00135
magnitude: 0.34271 au
magnitude: 0.87109 debye
