program: Orca
programVersion: 5.0.2
elementType: S S S P P O O O O O O C C C C C C C C C C C C C C C C H H H H H H H H H H H H H H H H H H H H
charge: 0
multiplicity: 1
keywords: wb97x-d3
keywords: def2-TZVPP
keywords: def2/J RIJCOSX
keywords: DEFGRID2
keywords: scfconv7
keywords: smallprint printgap noloewdin
keywords: NOSOSCF
formula: C16H20O6P2S3
InChI: InChI=1/C16H20O6P2S3/c1-17-23(25,18-2)21-13-5-9-15(10-6-13)27-16-11-7-14(8-12-16)22-24(26,19-3)20-4/h5-12H,1-4H3
47 atoms
S  0.064807 -4.186874 0.276747
S  -3.329552 1.336063 2.92238
S  2.020406 1.941605 -1.603365
P  -3.86615 1.305528 1.085108
P  3.802255 1.461594 -1.102802
O  -4.24956 -0.148246 0.477066
O  4.145301 -0.11547 -1.03876
O  -2.827704 1.836379 0.004907
O  -5.183701 2.115197 0.700379
O  4.97887 1.986762 -2.041542
O  4.316017 1.927419 0.333135
C  -1.292825 -3.041536 0.306944
C  1.352652 -3.012413 -0.059455
C  -3.286557 -1.12997 0.420267
C  3.227085 -1.070897 -0.678986
C  -2.073196 -2.916197 1.4478
C  2.124076 -3.128912 -1.207278
C  -1.549678 -2.233228 -0.796447
C  1.562892 -1.93949 0.800597
C  -3.077324 -1.959765 1.507654
C  3.065049 -2.158302 -1.518829
C  -2.535742 -1.267266 -0.73843
C  2.492867 -0.965043 0.493762
C  -1.714723 2.673089 0.305923
C  -6.349036 2.043362 1.51216
C  4.861267 1.944692 -3.458286
C  4.09997 3.260373 0.783184
H  -1.875362 -3.5425 2.307413
H  1.965949 -3.960756 -1.880781
H  -0.951534 -2.335468 -1.69207
H  0.974967 -1.850568 1.704397
H  -3.669804 -1.836649 2.403564
H  3.651082 -2.232163 -2.425259
H  -2.720869 -0.617672 -1.582921
H  2.644315 -0.132148 1.16684
H  -1.976785 3.7152 0.125892
H  -0.901165 2.381823 -0.354574
H  -1.396449 2.555303 1.341823
H  -6.826391 1.065842 1.43009
H  -6.114532 2.241367 2.558939
H  -7.03393 2.803598 1.14509
H  4.909199 0.918368 -3.825217
H  3.928555 2.401419 -3.791659
H  5.702893 2.503364 -3.859671
H  3.055591 3.552938 0.665226
H  4.364994 3.282339 1.837096
H  4.733568 3.963241 0.241192
totalener: -2950.70879609 hartree
nucrepener: 3469.31058154 hartree
electener: -6420.01937762 hartree
twoeener: 4549.19227398 hartree
kineticenergy: 2942.65243095 hartree
xcener: -192.766944657361 hartree
chargesum: 0.0000000
charge: -0.049866 -0.407456 -0.402258 0.729627 0.719837 -0.336015 -0.318153 -0.319936 -0.311029 -0.314262 -0.314456 0.002008 0.020410 0.250404 0.222276 -0.128991 -0.140402 -0.067022 -0.095082 -0.146881 -0.137740 -0.177142 -0.125509 -0.094491 -0.124057 -0.125597 -0.126635 0.118357 0.117180 0.118759 0.121544 0.123895 0.117893 0.126236 0.120061 0.111102 0.114543 0.102352 0.115191 0.107862 0.116169 0.111866 0.112291 0.117872 0.107657 0.119198 0.118392
qa: -0.0499 -0.4075 -0.4023 0.7296 0.7198 -0.3360 -0.3182 -0.3199 -0.3110 -0.3143 -0.3145 0.0020 0.0204 0.2504 0.2223 -0.1290 -0.1404 -0.0670 -0.0951 -0.1469 -0.1377 -0.1771 -0.1255 -0.0945 -0.1241 -0.1256 -0.1266 0.1184 0.1172 0.1188 0.1215 0.1239 0.1179 0.1262 0.1201 0.1111 0.1145 0.1024 0.1152 0.1079 0.1162 0.1119 0.1123 0.1179 0.1077 0.1192 0.1184
va: 2.2765 2.0334 2.0250 5.5211 5.5068 2.1167 2.1462 2.1310 2.1320 2.1261 2.1161 3.8317 3.8239 3.8022 3.8312 3.9880 4.0088 3.9168 3.9724 4.0484 4.0311 4.0583 3.9772 3.8498 3.8705 3.8720 3.8620 1.0188 1.0190 1.0025 1.0048 1.0162 1.0090 1.0138 1.0178 0.9892 0.9950 1.0155 0.9876 1.0046 0.9907 0.9875 1.0031 0.9907 1.0045 0.9905 0.9906
dispcorr: -0.025073352 hartree
energy: -2950.733869440589
dipole: 2.77305 -2.12209 0.65096 11.10667 -10.03845 1.06822 -2.83984 2.19333 -0.64650
magnitude: 1.40812 au
magnitude: 3.57916 debye
