program: Orca
programVersion: 5.0.2
elementType: S S S P P O O O O O O C C C C C C C C C C C C C C C C H H H H H H H H H H H H H H H H H H H H
charge: 0
multiplicity: 1
keywords: wb97x-d3
keywords: def2-TZVPP
keywords: def2/J RIJCOSX
keywords: DEFGRID2
keywords: scfconv7
keywords: smallprint printgap noloewdin
keywords: NOSOSCF
formula: C16H20O6P2S3
InChI: InChI=1/C16H20O6P2S3/c1-17-23(25,18-2)21-13-5-9-15(10-6-13)27-16-11-7-14(8-12-16)22-24(26,19-3)20-4/h5-12H,1-4H3
47 atoms
S  -0.001763 -4.230422 -0.01177
S  -1.653363 1.93101 2.437726
S  1.624413 1.940792 -2.387972
P  -3.152032 1.583174 1.295166
P  3.151085 1.594718 -1.28356
O  -3.778715 0.084586 1.417569
O  3.773026 0.095854 -1.415463
O  -2.942077 1.783273 -0.265783
O  -4.46952 2.443888 1.511926
O  4.463202 2.453327 -1.539329
O  2.980161 1.79656 0.282104
C  -1.246318 -3.042649 0.448695
C  1.239897 -3.036352 -0.463829
C  -2.969413 -0.983717 1.10888
C  2.962328 -0.972882 -1.111346
C  -1.348155 -2.612596 1.765455
C  2.050611 -2.472394 0.513198
C  -2.061614 -2.477187 -0.523729
C  1.345213 -2.601551 -1.778777
C  -2.205286 -1.576885 2.100707
C  2.911684 -1.435524 0.194982
C  -2.923455 -1.443007 -0.198946
C  2.202278 -1.563748 -2.107625
C  -1.652119 1.943573 -0.860745
C  -5.018178 2.620249 2.812869
C  4.975141 2.62506 -2.855797
C  1.712743 2.018454 0.904253
H  -0.729314 -3.0675 2.527225
H  1.987345 -2.826662 1.533295
H  -2.000759 -2.827555 -1.545346
H  0.729605 -3.054726 -2.544192
H  -2.262569 -1.211448 3.116595
H  3.532281 -0.979985 0.954922
H  -3.5471 -0.985536 -0.955272
H  2.262854 -1.195292 -3.122254
H  -1.824674 2.149584 -1.913228
H  -1.053865 1.037901 -0.769166
H  -1.110953 2.776488 -0.415498
H  -5.491555 1.703272 3.166064
H  -4.252736 2.929648 3.526273
H  -5.770361 3.400555 2.732069
H  5.735101 3.39981 -2.797173
H  5.431264 1.704576 -3.222247
H  4.19152 2.93997 -3.546675
H  1.918595 2.224989 1.950714
H  1.197819 2.870906 0.464304
H  1.073156 1.139569 0.834529
totalener: -2950.70659053 hartree
nucrepener: 3603.34715695 hartree
electener: -6554.05374748 hartree
twoeener: 4682.80257315 hartree
kineticenergy: 2942.65875967 hartree
xcener: -192.765913918383 hartree
chargesum: -0.0000000
charge: -0.067548 -0.419829 -0.419477 0.744545 0.745950 -0.335823 -0.336013 -0.323388 -0.304462 -0.304406 -0.324010 0.066541 0.065703 0.233946 0.236391 -0.142220 -0.115544 -0.114826 -0.140907 -0.132276 -0.184665 -0.185978 -0.133891 -0.097224 -0.128262 -0.128220 -0.096878 0.118125 0.117945 0.117925 0.118059 0.123303 0.136003 0.136221 0.122961 0.123824 0.096871 0.113328 0.117231 0.107517 0.117543 0.117685 0.117041 0.107974 0.123156 0.112681 0.097378
qa: -0.0675 -0.4198 -0.4195 0.7445 0.7459 -0.3358 -0.3360 -0.3234 -0.3045 -0.3044 -0.3240 0.0665 0.0657 0.2339 0.2364 -0.1422 -0.1155 -0.1148 -0.1409 -0.1323 -0.1847 -0.1860 -0.1339 -0.0972 -0.1283 -0.1282 -0.0969 0.1181 0.1179 0.1179 0.1181 0.1233 0.1360 0.1362 0.1230 0.1238 0.0969 0.1133 0.1172 0.1075 0.1175 0.1177 0.1170 0.1080 0.1232 0.1127 0.0974
va: 2.2206 2.0114 2.0117 5.4947 5.4937 2.0984 2.1000 2.1256 2.1534 2.1525 2.1241 3.8173 3.8197 3.8254 3.8266 4.0048 3.9607 3.9569 4.0035 4.0246 4.0053 4.0000 4.0259 3.8758 3.8733 3.8733 3.8731 1.0158 1.0117 1.0118 1.0159 1.0153 1.0092 1.0089 1.0151 0.9934 0.9858 1.0021 0.9880 1.0019 0.9910 0.9910 0.9881 1.0016 0.9944 1.0023 0.9889
dispcorr: -0.029461127 hartree
energy: -2950.736051657006
dipole: 0.04873 -0.03291 0.01582 6.58945 -6.21567 0.37377 -0.06375 0.04646 -0.01729
magnitude: 0.37451 au
magnitude: 0.95193 debye
