program: Orca
programVersion: 5.0.2
elementType: S S S P P O O O O O O C C C C C C C C C C C C C C C C H H H H H H H H H H H H H H H H H H H H
charge: 0
multiplicity: 1
keywords: wb97x-d3
keywords: def2-TZVPP
keywords: def2/J RIJCOSX
keywords: DEFGRID2
keywords: scfconv7
keywords: smallprint printgap noloewdin
keywords: NOSOSCF
formula: C16H20O6P2S3
InChI: InChI=1/C16H20O6P2S3/c1-17-23(25,18-2)21-13-5-9-15(10-6-13)27-16-11-7-14(8-12-16)22-24(26,19-3)20-4/h5-12H,1-4H3
47 atoms
S  -0.012204 -3.228449 -0.107223
S  -6.657485 -0.750474 0.426389
S  5.821017 0.718684 2.064765
P  -5.669332 0.788928 -0.129119
P  5.597933 1.090477 0.204406
O  -4.165959 0.942022 0.4401
O  4.943967 -0.059277 -0.715829
O  -6.264377 2.211854 0.277105
O  -5.411264 0.969375 -1.691472
O  4.673326 2.328323 -0.188464
O  6.921733 1.394557 -0.631555
C  -1.258557 -1.978841 0.029599
C  1.447189 -2.237666 -0.256144
C  -3.234144 -0.058992 0.283339
C  3.783806 -0.75243 -0.498539
C  -1.350669 -0.943748 -0.896985
C  1.671651 -1.135911 0.560908
C  -2.176917 -2.053375 1.068687
C  2.412285 -2.595631 -1.18936
C  -2.331252 0.022268 -0.76688
C  2.824163 -0.380983 0.43418
C  -3.176695 -1.099735 1.192634
C  3.58377 -1.86535 -1.300619
C  -6.878965 2.416142 1.543415
C  -6.392631 0.593028 -2.651347
C  4.770476 3.561405 0.51481
C  8.125121 0.673619 -0.394669
H  -0.644818 -0.886102 -1.71491
H  0.933595 -0.850069 1.298376
H  -2.105193 -2.852993 1.793854
H  2.245778 -3.442885 -1.841693
H  -2.398099 0.838193 -1.473783
H  2.963846 0.475319 1.078146
H  -3.893647 -1.155407 1.999913
H  4.334247 -2.142102 -2.029027
H  -7.63024 1.652053 1.746564
H  -7.354983 3.392556 1.506669
H  -6.138709 2.411083 2.344565
H  -6.753526 -0.419924 -2.471414
H  -7.23774 1.282341 -2.638617
H  -5.911366 0.638617 -3.624963
H  5.701813 4.076319 0.275904
H  3.932502 4.173592 0.191406
H  4.71341 3.407628 1.593379
H  8.912718 1.192285 -0.935142
H  8.368936 0.648058 0.668069
H  8.049904 -0.348365 -0.7684
totalener: -2950.71040370 hartree
nucrepener: 3265.09067078 hartree
electener: -6215.80107448 hartree
twoeener: 4344.88319690 hartree
kineticenergy: 2942.65310786 hartree
xcener: -192.770084773644 hartree
chargesum: 0.0000000
charge: -0.028024 -0.397247 -0.384661 0.723382 0.698233 -0.335539 -0.297766 -0.311406 -0.318001 -0.309085 -0.317360 -0.003586 -0.007997 0.241348 0.270658 -0.096073 -0.136208 -0.114980 -0.106222 -0.161888 -0.112566 -0.143736 -0.179533 -0.122133 -0.122327 -0.125595 -0.124929 0.127724 0.128027 0.118413 0.114492 0.127055 0.094532 0.122987 0.120569 0.110512 0.116014 0.114341 0.115273 0.113762 0.113822 0.116887 0.118643 0.109105 0.115737 0.111343 0.114004
qa: -0.0280 -0.3972 -0.3847 0.7234 0.6982 -0.3355 -0.2978 -0.3114 -0.3180 -0.3091 -0.3174 -0.0036 -0.0080 0.2413 0.2707 -0.0961 -0.1362 -0.1150 -0.1062 -0.1619 -0.1126 -0.1437 -0.1795 -0.1221 -0.1223 -0.1256 -0.1249 0.1277 0.1280 0.1184 0.1145 0.1271 0.0945 0.1230 0.1206 0.1105 0.1160 0.1143 0.1153 0.1138 0.1138 0.1169 0.1186 0.1091 0.1157 0.1113 0.1140
va: 2.3451 2.0433 2.0497 5.5258 5.5442 2.1273 2.1968 2.1189 2.1281 2.1013 2.1260 3.8366 3.8572 3.8113 3.8218 3.9270 4.0063 4.0040 3.9886 4.0615 3.9503 4.0622 4.0389 3.8654 3.8714 3.8612 3.8694 0.9990 0.9985 1.0194 1.0186 1.0126 1.0457 1.0159 1.0127 1.0052 0.9911 0.9870 1.0029 0.9874 0.9914 0.9904 0.9900 1.0058 0.9903 1.0047 0.9874
dispcorr: -0.022627445 hartree
energy: -2950.733031144833
dipole: 0.04802 0.16878 0.21680 10.00635 -8.59717 1.40917 -3.26658 2.51816 -0.74842
magnitude: 1.61025 au
magnitude: 4.09293 debye
