program: Orca
programVersion: 5.0.2
elementType: S S S P P O O O O O O C C C C C C C C C C C C C C C C H H H H H H H H H H H H H H H H H H H H
charge: 0
multiplicity: 1
keywords: wb97x-d3
keywords: def2-TZVPP
keywords: def2/J RIJCOSX
keywords: DEFGRID2
keywords: scfconv7
keywords: smallprint printgap noloewdin
keywords: NOSOSCF
formula: C16H20O6P2S3
InChI: InChI=1/C16H20O6P2S3/c1-17-23(25,18-2)21-13-5-9-15(10-6-13)27-16-11-7-14(8-12-16)22-24(26,19-3)20-4/h5-12H,1-4H3
47 atoms
S  0.045601 -2.30828 1.13661
S  -6.870791 -1.131066 0.733616
S  6.705902 -0.943021 0.037953
P  -6.151935 0.498112 0.035999
P  6.118433 0.816543 -0.411509
O  -4.819402 0.389264 -0.869213
O  4.555807 0.994336 -0.781338
O  -5.693475 1.605198 1.087249
O  -7.093505 1.334038 -0.943627
O  6.276103 1.955469 0.694298
O  6.804338 1.514219 -1.673744
C  -1.373574 -1.464471 0.500881
C  1.368241 -1.284253 0.562332
C  -3.688712 -0.238764 -0.394327
C  3.532219 0.222207 -0.29824
C  -2.403727 -2.223032 -0.041673
C  1.497762 -0.948954 -0.782375
C  -1.511279 -0.082197 0.586845
C  2.331163 -0.856972 1.466565
C  -3.569878 -1.61454 -0.479854
C  2.570888 -0.190859 -1.210483
C  -2.664256 0.53253 0.133304
C  3.419853 -0.110039 1.041455
C  -6.456935 1.865382 2.259107
C  -7.925823 0.682533 -1.896573
C  7.508611 2.117033 1.386782
C  7.031449 0.775954 -2.868994
H  -2.296286 -3.296479 -0.125957
H  0.756099 -1.281605 -1.49636
H  -0.71547 0.516875 1.009016
H  2.230536 -1.102679 2.51536
H  -4.375938 -2.204735 -0.893077
H  2.672871 0.074097 -2.254642
H  -2.774905 1.606764 0.194242
H  4.157541 0.22015 1.759847
H  -5.85437 2.517306 2.886431
H  -6.678676 0.943884 2.798483
H  -7.39162 2.371175 2.01295
H  -8.527066 -0.098352 -1.428746
H  -8.580039 1.443937 -2.314359
H  -7.334001 0.243342 -2.701052
H  8.27497 2.531171 0.73015
H  7.323309 2.814373 2.199828
H  7.860074 1.168387 1.7956
H  7.579424 -0.145462 -2.667119
H  6.091028 0.529346 -3.365004
H  7.620449 1.412257 -3.524731
totalener: -2950.71068602 hartree
nucrepener: 3233.35690070 hartree
electener: -6184.06758673 hartree
twoeener: 4313.24358604 hartree
kineticenergy: 2942.64448193 hartree
xcener: -192.766213683734 hartree
chargesum: -0.0000000
charge: -0.022506 -0.398287 -0.377627 0.724510 0.697730 -0.336623 -0.315986 -0.315760 -0.312608 -0.312267 -0.316999 -0.004389 -0.006100 0.241164 0.231381 -0.118241 -0.095258 -0.095136 -0.129002 -0.144727 -0.157275 -0.170873 -0.107462 -0.122641 -0.123162 -0.125356 -0.123417 0.116213 0.128308 0.129971 0.117478 0.123806 0.120003 0.125854 0.112162 0.113141 0.113872 0.113535 0.110890 0.116361 0.114571 0.116894 0.117312 0.108319 0.111773 0.110526 0.115930
qa: -0.0225 -0.3983 -0.3776 0.7245 0.6977 -0.3366 -0.3160 -0.3158 -0.3126 -0.3123 -0.3170 -0.0044 -0.0061 0.2412 0.2314 -0.1182 -0.0953 -0.0951 -0.1290 -0.1447 -0.1573 -0.1709 -0.1075 -0.1226 -0.1232 -0.1254 -0.1234 0.1162 0.1283 0.1300 0.1175 0.1238 0.1200 0.1259 0.1122 0.1131 0.1139 0.1135 0.1109 0.1164 0.1146 0.1169 0.1173 0.1083 0.1118 0.1105 0.1159
va: 2.3533 2.0423 2.0555 5.5255 5.5322 2.1269 2.1457 2.1312 2.1171 2.1087 2.1194 3.8566 3.8493 3.8101 3.8488 3.9949 3.9530 3.9103 4.0243 4.0592 4.0207 4.0712 3.9735 3.8730 3.8657 3.8619 3.8745 1.0196 0.9987 0.9958 1.0207 1.0159 1.0097 1.0133 1.0224 0.9917 1.0032 0.9874 1.0053 0.9911 0.9871 0.9907 0.9901 1.0053 1.0036 0.9873 0.9913
dispcorr: -0.022687791 hartree
energy: -2950.733373814594
dipole: 0.37362 -0.20534 0.16828 8.64618 -7.17755 1.46863 -2.68303 2.09921 -0.58382
magnitude: 1.58935 au
magnitude: 4.03981 debye
