program: Orca
programVersion: 5.0.2
elementType: S S S P P O O O O O O C C C C C C C C C C C C C C C C H H H H H H H H H H H H H H H H H H H H
charge: 0
multiplicity: 1
keywords: wb97x-d3
keywords: def2-TZVPP
keywords: def2/J RIJCOSX
keywords: DEFGRID2
keywords: scfconv7
keywords: smallprint printgap noloewdin
keywords: NOSOSCF
formula: C16H20O6P2S3
InChI: InChI=1/C16H20O6P2S3/c1-17-23(25,18-2)21-13-5-9-15(10-6-13)27-16-11-7-14(8-12-16)22-24(26,19-3)20-4/h5-12H,1-4H3
47 atoms
S  -0.134098 -2.960869 -0.475029
S  -6.686682 -0.852911 0.503576
S  5.662514 0.932347 -2.539905
P  -5.788783 0.769826 0.9611
P  5.761134 0.958291 -0.63265
O  -4.393815 1.078807 0.20741
O  5.086728 -0.268212 0.166244
O  -5.355985 0.963078 2.482831
O  -6.562523 2.132359 0.665953
O  7.219475 0.941148 0.013165
O  5.083663 2.189969 0.120288
C  -1.361394 -1.706791 -0.259988
C  1.379926 -2.070953 -0.275642
C  -3.407982 0.129108 0.068957
C  3.849609 -0.818876 -0.030375
C  -1.35472 -0.839742 0.829031
C  2.418135 -2.690915 0.41052
C  -2.402589 -1.645223 -1.178074
C  1.594587 -0.818533 -0.838779
C  -2.371422 0.085392 0.989912
C  3.653044 -2.07589 0.51952
C  -3.437129 -0.738546 -1.008122
C  2.815851 -0.180428 -0.702852
C  -6.162877 0.486212 3.55316
C  -7.194791 2.351921 -0.588193
C  8.242506 0.097442 -0.503214
C  5.258923 3.520765 -0.351448
H  -0.550656 -0.885124 1.55163
H  2.262078 -3.659674 0.866881
H  -2.404678 -2.308483 -2.032875
H  0.801103 -0.325772 -1.384639
H  -2.366007 0.768529 1.82872
H  4.461661 -2.560843 1.049953
H  -4.25364 -0.69825 -1.71567
H  2.949716 0.796826 -1.144416
H  -5.545524 0.515392 4.447609
H  -6.4946 -0.537058 3.373885
H  -7.033875 1.12616 3.698729
H  -7.787145 3.257958 -0.488087
H  -6.456858 2.496518 -1.3790
H  -7.848045 1.519299 -0.853658
H  9.171689 0.404315 -0.029484
H  8.047384 -0.947895 -0.259847
H  8.334476 0.201984 -1.585134
H  5.048997 3.594148 -1.41953
H  4.558421 4.143297 0.199263
H  6.273838 3.872353 -0.161353
totalener: -2950.71095768 hartree
nucrepener: 3247.87347408 hartree
electener: -6198.58443176 hartree
twoeener: 4327.65849118 hartree
kineticenergy: 2942.64417868 hartree
xcener: -192.768753565054 hartree
chargesum: 0.0000000
charge: -0.018213 -0.392340 -0.383908 0.722042 0.698438 -0.340485 -0.300223 -0.319447 -0.309517 -0.317405 -0.309588 -0.001328 -0.004217 0.235217 0.262572 -0.109978 -0.106639 -0.112691 -0.144295 -0.156057 -0.175955 -0.137291 -0.110520 -0.120737 -0.122455 -0.124229 -0.124505 0.132282 0.114781 0.118324 0.130420 0.129087 0.119812 0.119209 0.096770 0.113119 0.113397 0.114551 0.116754 0.114125 0.107319 0.116224 0.113226 0.110637 0.108585 0.117961 0.117170
qa: -0.0182 -0.3923 -0.3839 0.7220 0.6984 -0.3405 -0.3002 -0.3194 -0.3095 -0.3174 -0.3096 -0.0013 -0.0042 0.2352 0.2626 -0.1100 -0.1066 -0.1127 -0.1443 -0.1561 -0.1760 -0.1373 -0.1105 -0.1207 -0.1225 -0.1242 -0.1245 0.1323 0.1148 0.1183 0.1304 0.1291 0.1198 0.1192 0.0968 0.1131 0.1134 0.1146 0.1168 0.1141 0.1073 0.1162 0.1132 0.1106 0.1086 0.1180 0.1172
va: 2.3730 2.0483 2.0506 5.5315 5.5444 2.1162 2.1873 2.1308 2.1210 2.1270 2.1020 3.8508 3.8697 3.8161 3.8289 3.9391 3.9860 4.0002 4.0083 4.0613 4.0369 4.0565 3.9500 3.8683 3.8681 3.8702 3.8602 0.9968 1.0183 1.0193 0.9977 1.0115 1.0126 1.0146 1.0427 0.9908 1.0048 0.9871 0.9909 0.9883 1.0050 0.9902 0.9880 1.0043 1.0063 0.9899 0.9904
dispcorr: -0.022548463 hartree
energy: -2950.733506143394
dipole: 1.21833 -0.81548 0.40285 8.69504 -7.49859 1.19646 4.10074 -3.30374 0.79700
magnitude: 1.49298 au
magnitude: 3.79486 debye
