program: Orca
programVersion: 5.0.2
elementType: S S S P P O O O O O O C C C C C C C C C C C C C C C C H H H H H H H H H H H H H H H H H H H H
charge: 0
multiplicity: 1
keywords: wb97x-d3
keywords: def2-TZVPP
keywords: def2/J RIJCOSX
keywords: DEFGRID2
keywords: scfconv7
keywords: smallprint printgap noloewdin
keywords: NOSOSCF
formula: C16H20O6P2S3
InChI: InChI=1/C16H20O6P2S3/c1-17-23(25,18-2)21-13-5-9-15(10-6-13)27-16-11-7-14(8-12-16)22-24(26,19-3)20-4/h5-12H,1-4H3
47 atoms
S  0.166254 -2.754568 1.044079
S  -5.611334 1.069053 2.223477
S  6.478147 -0.315571 0.413003
P  -5.795448 0.799998 0.339919
P  5.776965 0.834711 -0.937746
O  -5.153873 -0.544921 -0.277204
O  4.184214 1.115539 -0.899812
O  -5.163028 1.900877 -0.623707
O  -7.280486 0.680471 -0.231901
O  6.340491 2.325953 -0.992962
O  5.950523 0.383241 -2.459028
C  -1.384964 -2.002591 0.647953
C  1.329082 -1.574938 0.427151
C  -3.898004 -0.996181 0.059117
C  3.262827 0.194122 -0.47241
C  -2.455411 -2.239656 1.503793
C  2.26059 -1.976879 -0.520142
C  -1.584792 -1.250659 -0.504962
C  1.370192 -0.273463 0.919163
C  -3.715247 -1.745985 1.208058
C  3.233858 -1.097663 -0.969813
C  -2.83649 -0.732861 -0.791044
C  2.329396 0.612432 0.465542
C  -5.235968 3.286081 -0.309782
C  -8.24389 -0.132546 0.426115
C  6.57164 3.064396 0.200366
C  7.208988 -0.096001 -2.921868
H  -2.304978 -2.805764 2.413939
H  2.225375 -2.983768 -0.913839
H  -0.762705 -1.063071 -1.182564
H  0.651039 0.044783 1.662143
H  -4.545796 -1.929045 1.875552
H  3.949035 -1.420253 -1.714026
H  -2.995914 -0.147107 -1.686446
H  2.368639 1.623751 0.847688
H  -6.248758 3.665534 -0.449959
H  -4.566404 3.798365 -0.995989
H  -4.920098 3.476332 0.71651
H  -8.008434 -1.191583 0.310398
H  -8.304539 0.107098 1.488798
H  -9.202302 0.069738 -0.045234
H  7.180009 2.496867 0.905443
H  7.099345 3.969771 -0.088403
H  5.631491 3.339521 0.680803
H  7.041207 -0.517476 -3.909576
H  7.931849 0.716849 -2.998684
H  7.60511 -0.867782 -2.260455
totalener: -2950.71107386 hartree
nucrepener: 3256.50167323 hartree
electener: -6207.21274710 hartree
twoeener: 4336.35861945 hartree
kineticenergy: 2942.65944608 hartree
xcener: -192.768775055449 hartree
chargesum: 0.0000000
charge: -0.022381 -0.397691 -0.374560 0.723847 0.697599 -0.339813 -0.319026 -0.317250 -0.310295 -0.316178 -0.316041 0.017472 0.000498 0.233979 0.217537 -0.128078 -0.125592 -0.114637 -0.106011 -0.131352 -0.105442 -0.169172 -0.142406 -0.123530 -0.123246 -0.122334 -0.126299 0.112946 0.119151 0.129118 0.131377 0.118338 0.118547 0.127586 0.120079 0.114116 0.114103 0.111852 0.114213 0.108318 0.116711 0.110748 0.117052 0.111026 0.117381 0.117563 0.110175
qa: -0.0224 -0.3977 -0.3746 0.7238 0.6976 -0.3398 -0.3190 -0.3172 -0.3103 -0.3162 -0.3160 0.0175 0.0005 0.2340 0.2175 -0.1281 -0.1256 -0.1146 -0.1060 -0.1314 -0.1054 -0.1692 -0.1424 -0.1235 -0.1232 -0.1223 -0.1263 0.1129 0.1192 0.1291 0.1314 0.1183 0.1185 0.1276 0.1201 0.1141 0.1141 0.1119 0.1142 0.1083 0.1167 0.1107 0.1171 0.1110 0.1174 0.1176 0.1102
va: 2.3616 2.0418 2.0593 5.5285 5.5319 2.1203 2.1413 2.1338 2.1178 2.1194 2.1080 3.8694 3.8491 3.8072 3.8618 3.9970 4.0259 3.9136 3.9720 4.0532 3.9702 4.0853 4.0161 3.8722 3.8684 3.8695 3.8598 1.0188 1.0208 0.9970 0.9999 1.0164 1.0178 1.0119 1.0087 0.9872 0.9908 1.0041 0.9882 1.0046 0.9913 1.0055 0.9908 0.9875 0.9903 0.9908 1.0053
dispcorr: -0.022806315 hartree
energy: -2950.733880177061
dipole: 0.06116 0.01527 0.07643 8.16674 -7.14097 1.02577 -4.62140 3.64265 -0.97875
magnitude: 1.41986 au
magnitude: 3.60900 debye
