program: Orca
programVersion: 5.0.2
elementType: S S S P P O O O O O O C C C C C C C C C C C C C C C C H H H H H H H H H H H H H H H H H H H H
charge: 0
multiplicity: 1
keywords: wb97x-d3
keywords: def2-TZVPP
keywords: def2/J RIJCOSX
keywords: DEFGRID2
keywords: scfconv7
keywords: smallprint printgap noloewdin
keywords: NOSOSCF
formula: C16H20O6P2S3
InChI: InChI=1/C16H20O6P2S3/c1-17-23(25,18-2)21-13-5-9-15(10-6-13)27-16-11-7-14(8-12-16)22-24(26,19-3)20-4/h5-12H,1-4H3
47 atoms
S  0.106814 -3.175315 -0.316187
S  -5.524442 0.307621 3.110659
S  4.914004 1.484782 -2.853196
P  -5.512809 0.842552 1.274987
P  5.564239 1.011636 -1.118579
O  -4.987888 -0.222725 0.184942
O  4.471142 0.799791 0.051564
O  -4.6222 2.103872 0.881744
O  -6.924066 1.215914 0.63556
O  6.396367 -0.340367 -0.993427
O  6.529902 2.063492 -0.409002
C  -1.374745 -2.224894 -0.148919
C  1.367961 -1.939116 -0.204103
C  -3.776222 -0.856057 0.136824
C  3.449915 -0.117085 -0.069363
C  -1.570467 -1.359042 0.920251
C  1.262085 -0.706156 -0.840552
C  -2.397835 -2.401908 -1.072557
C  2.527139 -2.249734 0.497973
C  -2.756959 -0.660936 1.060971
C  2.295757 0.210819 -0.764829
C  -3.59927 -1.730099 -0.92483
C  3.576878 -1.34638 0.55326
C  -4.582397 3.261758 1.706682
C  -8.097297 0.470351 0.938002
C  7.255578 -0.792727 -2.032296
C  6.250036 3.457053 -0.445811
H  -0.7861 -1.220097 1.652217
H  0.367031 -0.456801 -1.394668
H  -2.254496 -3.064769 -1.915495
H  2.609476 -3.199952 1.009412
H  -2.882661 -0.000742 1.907224
H  2.214805 1.170455 -1.256363
H  -4.396725 -1.867636 -1.642776
H  4.479873 -1.585674 1.09842
H  -5.524217 3.809894 1.657583
H  -3.784503 3.892055 1.32279
H  -4.373627 3.001562 2.745084
H  -8.063952 -0.517557 0.477029
H  -8.229425 0.358459 2.014628
H  -8.93552 1.025901 0.525298
H  7.49129 -1.831104 -1.813872
H  6.768862 -0.727811 -3.005692
H  8.179101 -0.213133 -2.053027
H  7.129364 3.964647 -0.057371
H  6.055623 3.794631 -1.464653
H  5.392511 3.701727 0.182684
totalener: -2950.71065463 hartree
nucrepener: 3260.95837383 hartree
electener: -6211.66902846 hartree
twoeener: 4340.74742350 hartree
kineticenergy: 2942.64584024 hartree
xcener: -192.769956911197 hartree
chargesum: 0.0000000
charge: -0.024772 -0.387731 -0.399939 0.700314 0.725383 -0.296927 -0.337256 -0.305643 -0.315095 -0.316089 -0.311109 -0.017739 0.005460 0.278205 0.238524 -0.136318 -0.112614 -0.098284 -0.112507 -0.115569 -0.150003 -0.183540 -0.161887 -0.124748 -0.125809 -0.119450 -0.122871 0.129946 0.130782 0.117407 0.114914 0.097077 0.124729 0.121959 0.124224 0.116103 0.119050 0.109076 0.114731 0.111459 0.116570 0.113446 0.113128 0.113775 0.116161 0.108914 0.114561
qa: -0.0248 -0.3877 -0.3999 0.7003 0.7254 -0.2969 -0.3373 -0.3056 -0.3151 -0.3161 -0.3111 -0.0177 0.0055 0.2782 0.2385 -0.1363 -0.1126 -0.0983 -0.1125 -0.1156 -0.1500 -0.1835 -0.1619 -0.1247 -0.1258 -0.1195 -0.1229 0.1299 0.1308 0.1174 0.1149 0.0971 0.1247 0.1220 0.1242 0.1161 0.1190 0.1091 0.1147 0.1115 0.1166 0.1134 0.1131 0.1138 0.1162 0.1089 0.1146
va: 2.3615 2.0448 2.0418 5.5415 5.5268 2.2057 2.1244 2.1058 2.1276 2.1307 2.1214 3.8630 3.8525 3.8227 3.8087 4.0275 3.9460 3.9888 3.9683 3.9404 4.0482 4.0374 4.0861 3.8641 3.8709 3.8685 3.8671 1.0001 0.9967 1.0186 1.0188 1.0523 1.0174 1.0129 1.0126 0.9897 0.9902 1.0051 0.9872 1.0040 0.9900 0.9909 1.0050 0.9871 0.9908 1.0056 0.9874
dispcorr: -0.022443074 hartree
energy: -2950.733097706521
dipole: 1.39586 -1.39439 0.00147 7.69033 -6.82550 0.86483 -0.15435 0.15347 -0.00088
magnitude: 0.86483 au
magnitude: 2.19823 debye
