program: Orca
programVersion: 5.0.2
elementType: S S S P P O O O O O O C C C C C C C C C C C C C C C C H H H H H H H H H H H H H H H H H H H H
charge: 0
multiplicity: 1
keywords: wb97x-d3
keywords: def2-TZVPP
keywords: def2/J RIJCOSX
keywords: DEFGRID2
keywords: scfconv7
keywords: smallprint printgap noloewdin
keywords: NOSOSCF
formula: C16H20O6P2S3
InChI: InChI=1/C16H20O6P2S3/c1-17-23(25,18-2)21-13-5-9-15(10-6-13)27-16-11-7-14(8-12-16)22-24(26,19-3)20-4/h5-12H,1-4H3
47 atoms
S  0.069858 -3.265163 -0.520154
S  -5.389625 0.330602 3.140342
S  5.081663 1.22184 -2.869031
P  -5.40229 0.843157 1.298682
P  5.495014 1.041804 -1.011801
O  -4.975366 -0.266025 0.209576
O  4.249807 0.88335 0.003721
O  -4.445888 2.039853 0.861514
O  -6.806335 1.297671 0.696839
O  6.391765 -0.202734 -0.579237
O  6.257741 2.258471 -0.317089
C  -1.410723 -2.328738 -0.272065
C  1.305195 -2.00459 -0.384603
C  -3.780187 -0.927298 0.115869
C  3.295395 -0.093465 -0.166464
C  -1.541106 -1.441896 0.78978
C  1.202139 -0.803614 -1.081061
C  -2.487091 -2.518678 -1.129778
C  2.420775 -2.24372 0.407939
C  -2.711227 -0.729358 0.981504
C  2.190049 0.157216 -0.965999
C  -3.672041 -1.829968 -0.930698
C  3.426939 -1.294292 0.507981
C  -4.302825 3.202624 1.668426
C  -8.016038 0.635012 1.045888
C  7.391714 -0.738807 -1.43769
C  5.942859 3.606023 -0.64418
H  -0.71676 -1.293885 1.47458
H  0.341856 -0.614518 -1.709161
H  -2.397515 -3.198315 -1.966982
H  2.499473 -3.170135 0.961412
H  -2.780314 -0.052721 1.821224
H  2.11153 1.093747 -1.500745
H  -4.508032 -1.973481 -1.602209
H  4.292788 -1.473572 1.130713
H  -4.080983 2.941361 2.703928
H  -5.206217 3.813088 1.63904
H  -3.475523 3.771982 1.252516
H  -8.829429 1.250302 0.669612
H  -8.070256 -0.350131 0.580986
H  -8.111196 0.526959 2.126893
H  7.003824 -0.902743 -2.44328
H  8.257707 -0.078126 -1.491111
H  7.695643 -1.689339 -1.006612
H  6.710407 4.226342 -0.188274
H  5.943286 3.761959 -1.723729
H  4.969748 3.891415 -0.242024
totalener: -2950.71021390 hartree
nucrepener: 3271.67003606 hartree
electener: -6222.38024996 hartree
twoeener: 4351.45140535 hartree
kineticenergy: 2942.64984343 hartree
xcener: -192.769959584785 hartree
chargesum: 0.0000000
charge: -0.029299 -0.386873 -0.397598 0.700317 0.722740 -0.298163 -0.335080 -0.306342 -0.315530 -0.319901 -0.310183 -0.016782 -0.001896 0.281027 0.239846 -0.132636 -0.098518 -0.100808 -0.112802 -0.119216 -0.149177 -0.184524 -0.159696 -0.124665 -0.124997 -0.120659 -0.122572 0.127744 0.128585 0.115985 0.116540 0.094764 0.122398 0.121622 0.126638 0.108782 0.116715 0.118803 0.116259 0.114984 0.110845 0.114921 0.114631 0.113523 0.116878 0.109761 0.113611
qa: -0.0293 -0.3869 -0.3976 0.7003 0.7227 -0.2982 -0.3351 -0.3063 -0.3155 -0.3199 -0.3102 -0.0168 -0.0019 0.2810 0.2398 -0.1326 -0.0985 -0.1008 -0.1128 -0.1192 -0.1492 -0.1845 -0.1597 -0.1247 -0.1250 -0.1207 -0.1226 0.1277 0.1286 0.1160 0.1165 0.0948 0.1224 0.1216 0.1266 0.1088 0.1167 0.1188 0.1163 0.1150 0.1108 0.1149 0.1146 0.1135 0.1169 0.1098 0.1136
va: 2.3458 2.0466 2.0423 5.5421 5.5260 2.2057 2.1256 2.1035 2.1279 2.1257 2.1206 3.8597 3.8388 3.8150 3.8119 4.0178 3.9428 3.9862 3.9774 3.9477 4.0496 4.0402 4.0823 3.8635 3.8693 3.8698 3.8665 0.9997 0.9981 1.0184 1.0194 1.0515 1.0159 1.0129 1.0127 1.0054 0.9899 0.9901 0.9900 0.9873 1.0049 1.0035 0.9870 0.9913 0.9909 1.0051 0.9872
dispcorr: -0.022626090 hartree
energy: -2950.732839994102
dipole: 1.52982 -1.48156 0.04826 8.36454 -7.36346 1.00108 0.31352 -0.28530 0.02822
magnitude: 1.00264 au
magnitude: 2.54851 debye
