program: Orca
programVersion: 5.0.2
elementType: S S S P P O O O O O O C C C C C C C C C C C C C C C C H H H H H H H H H H H H H H H H H H H H
charge: 0
multiplicity: 1
keywords: wb97x-d3
keywords: def2-TZVPP
keywords: def2/J RIJCOSX
keywords: DEFGRID2
keywords: scfconv7
keywords: smallprint printgap noloewdin
keywords: NOSOSCF
formula: C16H20O6P2S3
InChI: InChI=1/C16H20O6P2S3/c1-17-23(25,18-2)21-13-5-9-15(10-6-13)27-16-11-7-14(8-12-16)22-24(26,19-3)20-4/h5-12H,1-4H3
47 atoms
S  0.104146 -2.717029 0.696329
S  -6.744632 -1.197235 0.826729
S  5.643965 2.022557 1.210472
P  -6.015135 0.464191 0.225924
P  5.996433 1.061936 -0.403077
O  -4.719173 0.3887 -0.734088
O  4.743401 0.422374 -1.188462
O  -5.495884 1.48271 1.338218
O  -6.964565 1.393709 -0.656956
O  6.679548 1.877893 -1.591606
O  6.9482 -0.211886 -0.297255
C  -1.306851 -1.749078 0.249296
C  1.449967 -1.704481 0.156943
C  -3.602943 -0.334335 -0.377213
C  3.682326 -0.272385 -0.674873
C  -1.413657 -0.403369 0.588389
C  1.469023 -1.101522 -1.097749
C  -2.362039 -2.377621 -0.400546
C  2.557188 -1.577267 0.984353
C  -2.556156 0.30797 0.267869
C  2.570796 -0.373363 -1.502736
C  -3.519639 -1.676447 -0.702315
C  3.682247 -0.877123 0.571459
C  -6.17479 1.620662 2.581992
C  -7.859176 0.841419 -1.614966
C  6.281939 3.211667 -1.888072
C  8.139465 -0.159507 0.480379
H  -0.599913 0.090868 1.102328
H  0.61744 -1.194789 -1.758596
H  -2.279347 -3.420722 -0.675865
H  2.548145 -2.028171 1.967935
H  -2.64035 1.356032 0.521293
H  2.584656 0.10248 -2.474361
H  -4.345507 -2.166609 -1.198924
H  4.530221 -0.801259 1.237027
H  -7.111818 2.164151 2.457039
H  -5.518231 2.188258 3.236335
H  -6.381648 0.648236 3.029809
H  -8.538085 1.638509 -1.906674
H  -7.320939 0.491722 -2.496801
H  -8.430366 0.013575 -1.193039
H  5.308778 3.228228 -2.380283
H  6.236449 3.822396 -0.985427
H  7.028878 3.620307 -2.563663
H  8.520432 -1.175676 0.539279
H  8.88883 0.475697 0.006613
H  7.93916 0.213312 1.485766
totalener: -2950.71096321 hartree
nucrepener: 3234.56448570 hartree
electener: -6185.27544890 hartree
twoeener: 4314.39070962 hartree
kineticenergy: 2942.64002693 hartree
xcener: -192.767576091793 hartree
chargesum: -0.0000000
charge: -0.021161 -0.396906 -0.389067 0.723811 0.700172 -0.335901 -0.298753 -0.318879 -0.311497 -0.316786 -0.307750 -0.006385 -0.009997 0.236189 0.264663 -0.102830 -0.094061 -0.112862 -0.138870 -0.159694 -0.181535 -0.140876 -0.117589 -0.121342 -0.122080 -0.125008 -0.126175 0.132643 0.129165 0.117296 0.115685 0.128758 0.121746 0.120423 0.098717 0.113620 0.113291 0.114604 0.116093 0.114244 0.110050 0.113187 0.110746 0.115968 0.118769 0.116441 0.109724
qa: -0.0212 -0.3969 -0.3891 0.7238 0.7002 -0.3359 -0.2988 -0.3189 -0.3115 -0.3168 -0.3078 -0.0064 -0.0100 0.2362 0.2647 -0.1028 -0.0941 -0.1129 -0.1389 -0.1597 -0.1815 -0.1409 -0.1176 -0.1213 -0.1221 -0.1250 -0.1262 0.1326 0.1292 0.1173 0.1157 0.1288 0.1217 0.1204 0.0987 0.1136 0.1133 0.1146 0.1161 0.1142 0.1101 0.1132 0.1107 0.1160 0.1188 0.1164 0.1097
va: 2.3634 2.0437 2.0445 5.5265 5.5420 2.1272 2.1893 2.1279 2.1196 2.1273 2.1056 3.8497 3.8667 3.8188 3.8299 3.9302 3.9394 3.9937 4.0394 4.0581 4.0183 4.0589 3.9727 3.8701 3.8642 3.8705 3.8615 0.9965 0.9965 1.0196 1.0210 1.0127 1.0124 1.0154 1.0423 0.9875 0.9914 1.0039 0.9909 0.9872 1.0061 0.9879 1.0047 0.9904 0.9902 0.9903 1.0053
dispcorr: -0.022447350 hartree
energy: -2950.733410556495
dipole: 1.03425 -0.70749 0.32677 7.38964 -6.42337 0.96627 -1.94317 1.29268 -0.65050
magnitude: 1.20979 au
magnitude: 3.07504 debye
