program: Orca
programVersion: 5.0.2
elementType: S S S P P O O O O O O C C C C C C C C C C C C C C C C H H H H H H H H H H H H H H H H H H H H
charge: 0
multiplicity: 1
keywords: wb97x-d3
keywords: def2-TZVPP
keywords: def2/J RIJCOSX
keywords: DEFGRID2
keywords: scfconv7
keywords: smallprint printgap noloewdin
keywords: NOSOSCF
formula: C16H20O6P2S3
InChI: InChI=1/C16H20O6P2S3/c1-17-23(25,18-2)21-13-5-9-15(10-6-13)27-16-11-7-14(8-12-16)22-24(26,19-3)20-4/h5-12H,1-4H3
47 atoms
S  0.001393 -3.335601 0.228342
S  -4.862988 1.326497 2.609414
S  4.091768 2.368921 -0.374246
P  -5.469294 0.883479 0.851475
P  5.357819 1.05978 -0.942513
O  -4.347538 0.637672 -0.282067
O  5.116398 -0.458296 -0.448212
O  -6.371696 1.970403 0.11129
O  -6.345217 -0.439266 0.691804
O  5.520376 0.827316 -2.512783
O  6.875786 1.272486 -0.497626
C  -1.25963 -2.103294 0.077208
C  1.482874 -2.391324 0.024129
C  -3.336699 -0.283432 -0.121366
C  3.889484 -1.053895 -0.313562
C  -1.133889 -0.834745 0.634544
C  1.723052 -1.657416 -1.133207
C  -2.437628 -2.45245 -0.573888
C  2.460081 -2.447162 1.009714
C  -2.167194 0.079579 0.528148
C  2.916791 -0.979882 -1.30233
C  -3.484527 -1.54881 -0.66217
C  3.664305 -1.782228 0.841483
C  -6.095032 3.360819 0.224504
C  -7.290142 -0.824722 1.683239
C  5.613257 1.939091 -3.396703
C  7.193618 1.759552 0.80079
H  -0.224809 -0.554059 1.149522
H  0.970907 -1.615321 -1.909762
H  -2.536897 -3.432609 -1.021962
H  2.276102 -3.005974 1.917545
H  -2.071261 1.067621 0.95679
H  3.094453 -0.424546 -2.212982
H  -4.400717 -1.816889 -1.170623
H  4.426838 -1.823651 1.607646
H  -5.950408 3.652699 1.265708
H  -6.95498 3.886656 -0.18325
H  -5.207436 3.631411 -0.349371
H  -8.164917 -0.173396 1.663516
H  -7.597421 -1.839937 1.445046
H  -6.849083 -0.802695 2.680106
H  4.798913 2.64572 -3.230152
H  6.566048 2.456405 -3.276735
H  5.549397 1.543077 -4.406963
H  8.254137 1.998586 0.796079
H  6.61963 2.656026 1.03931
H  7.003009 1.001394 1.562017
totalener: -2950.71139082 hartree
nucrepener: 3279.21739033 hartree
electener: -6229.92878114 hartree
twoeener: 4359.24379312 hartree
kineticenergy: 2942.64695537 hartree
xcener: -192.766556158015 hartree
chargesum: -0.0000000
charge: -0.029255 -0.398302 -0.379708 0.723876 0.699905 -0.335704 -0.312781 -0.312010 -0.317772 -0.316295 -0.316605 0.010519 -0.009420 0.234660 0.225795 -0.108957 -0.109663 -0.119753 -0.112468 -0.150608 -0.107962 -0.156169 -0.151052 -0.121694 -0.121496 -0.127401 -0.121538 0.132040 0.128057 0.113294 0.118749 0.123991 0.116746 0.124881 0.118837 0.109539 0.115307 0.114698 0.113346 0.113216 0.113575 0.111310 0.117616 0.117916 0.116424 0.110747 0.111567
qa: -0.0293 -0.3983 -0.3797 0.7239 0.6999 -0.3357 -0.3128 -0.3120 -0.3178 -0.3163 -0.3166 0.0105 -0.0094 0.2347 0.2258 -0.1090 -0.1097 -0.1198 -0.1125 -0.1506 -0.1080 -0.1562 -0.1511 -0.1217 -0.1215 -0.1274 -0.1215 0.1320 0.1281 0.1133 0.1187 0.1240 0.1167 0.1249 0.1188 0.1095 0.1153 0.1147 0.1133 0.1132 0.1136 0.1113 0.1176 0.1179 0.1164 0.1107 0.1116
va: 2.3507 2.0432 2.0558 5.5280 5.5312 2.1276 2.1509 2.1180 2.1286 2.1064 2.1200 3.8579 3.8507 3.8097 3.8504 3.9398 3.9971 3.9743 3.9986 4.0565 3.9645 4.0841 4.0353 3.8652 3.8720 3.8600 3.8664 0.9961 1.0019 1.0191 1.0191 1.0161 1.0203 1.0129 1.0104 1.0061 0.9908 0.9873 0.9873 0.9912 1.0040 1.0045 0.9909 0.9905 0.9910 1.0059 0.9875
dispcorr: -0.022780871 hartree
energy: -2950.734171688197
dipole: -0.22780 0.53654 0.30874 6.54427 -6.07987 0.46440 -1.87379 1.30407 -0.56973
magnitude: 0.79723 au
magnitude: 2.02640 debye
