program: Orca
programVersion: 5.0.2
elementType: S S S P P O O O O O O C C C C C C C C C C C C C C C C H H H H H H H H H H H H H H H H H H H H
charge: 0
multiplicity: 1
keywords: wb97x-d3
keywords: def2-TZVPP
keywords: def2/J RIJCOSX
keywords: DEFGRID2
keywords: scfconv7
keywords: smallprint printgap noloewdin
keywords: NOSOSCF
formula: C16H20O6P2S3
InChI: InChI=1/C16H20O6P2S3/c1-17-23(25,18-2)21-13-5-9-15(10-6-13)27-16-11-7-14(8-12-16)22-24(26,19-3)20-4/h5-12H,1-4H3
47 atoms
S  0.024736 -3.425008 0.395449
S  -4.912829 1.106141 2.626378
S  3.835955 2.329464 -0.385739
P  -5.360897 0.911581 0.778704
P  5.167686 1.10322 -0.987157
O  -4.134106 0.728807 -0.254651
O  5.040861 -0.423656 -0.476909
O  -6.127242 2.125341 0.082675
O  -6.276719 -0.330143 0.374842
O  5.295124 0.869806 -2.560414
O  6.682077 1.415109 -0.59456
C  -1.199279 -2.158133 0.212974
C  1.506793 -2.500645 0.115671
C  -3.179749 -0.244921 -0.064708
C  3.853212 -1.086103 -0.308527
C  -2.35249 -2.444664 -0.50683
C  1.697547 -1.79357 -1.066894
C  -1.05069 -0.906411 0.80294
C  2.509725 -2.505715 1.075819
C  -3.352658 -1.492951 -0.637154
C  2.861137 -1.079278 -1.280246
C  -2.035722 0.053364 0.659218
C  3.685005 -1.801695 0.863829
C  -5.799712 3.474717 0.389328
C  -7.256861 -0.856381 1.261664
C  5.293266 1.977456 -3.453959
C  7.017059 1.891681 0.703007
H  -2.467012 -3.411659 -0.97894
H  0.925418 -1.793634 -1.824621
H  -0.15925 -0.675089 1.370582
H  2.366754 -3.046331 2.001921
H  -4.247332 -1.710959 -1.204242
H  2.997081 -0.540511 -2.2077
H  -1.921985 1.02852 1.112254
H  4.465022 -1.797078 1.613407
H  -4.837119 3.753341 -0.041702
H  -5.770158 3.640059 1.467223
H  -6.577945 4.093165 -0.050583
H  -7.574767 -1.808801 0.845115
H  -6.844993 -1.014605 2.258585
H  -8.11906 -0.192198 1.332091
H  6.220455 2.54627 -3.373432
H  5.212714 1.570445 -4.45866
H  4.448419 2.639863 -3.260375
H  8.064391 2.181355 0.670167
H  6.40901 2.754669 0.977347
H  6.887992 1.110423 1.453669
totalener: -2950.71102702 hartree
nucrepener: 3299.89217143 hartree
electener: -6250.60319845 hartree
twoeener: 4379.94661087 hartree
kineticenergy: 2942.66786355 hartree
xcener: -192.769910864412 hartree
chargesum: 0.0000000
charge: -0.035421 -0.396648 -0.379004 0.722648 0.700329 -0.334885 -0.314345 -0.310675 -0.321956 -0.316692 -0.316103 0.003995 -0.003384 0.236123 0.224684 -0.121951 -0.102470 -0.092086 -0.118609 -0.155637 -0.113574 -0.152514 -0.149794 -0.122309 -0.120365 -0.127336 -0.121750 0.114103 0.124806 0.128870 0.118387 0.126980 0.118204 0.122544 0.118371 0.114756 0.109210 0.116237 0.112431 0.114825 0.114866 0.118115 0.117688 0.110909 0.116483 0.110295 0.111648
qa: -0.0354 -0.3966 -0.3790 0.7226 0.7003 -0.3349 -0.3143 -0.3107 -0.3220 -0.3167 -0.3161 0.0040 -0.0034 0.2361 0.2247 -0.1220 -0.1025 -0.0921 -0.1186 -0.1556 -0.1136 -0.1525 -0.1498 -0.1223 -0.1204 -0.1273 -0.1218 0.1141 0.1248 0.1289 0.1184 0.1270 0.1182 0.1225 0.1184 0.1148 0.1092 0.1162 0.1124 0.1148 0.1149 0.1181 0.1177 0.1109 0.1165 0.1103 0.1116
va: 2.3295 2.0430 2.0571 5.5260 5.5322 2.1249 2.1483 2.1210 2.1225 2.1066 2.1208 3.8462 3.8387 3.8125 3.8477 3.9805 3.9862 3.9314 3.9997 4.0773 3.9660 4.0585 4.0368 3.8658 3.8704 3.8595 3.8682 1.0199 1.0029 0.9966 1.0190 1.0129 1.0195 1.0148 1.0101 0.9872 1.0056 0.9908 0.9914 1.0038 0.9871 0.9907 0.9904 1.0048 0.9910 1.0053 0.9876
dispcorr: -0.023087485 hartree
energy: -2950.734114503064
dipole: -0.05494 0.39522 0.34029 6.85105 -6.29249 0.55855 -2.31715 1.70510 -0.61205
magnitude: 0.89576 au
magnitude: 2.27685 debye
