program: Orca
programVersion: 5.0.2
elementType: S S S P P O O O O O O C C C C C C C C C C C C C C C C H H H H H H H H H H H H H H H H H H H H
charge: 0
multiplicity: 1
keywords: wb97x-d3
keywords: def2-TZVPP
keywords: def2/J RIJCOSX
keywords: DEFGRID2
keywords: scfconv7
keywords: smallprint printgap noloewdin
keywords: NOSOSCF
formula: C16H20O6P2S3
InChI: InChI=1/C16H20O6P2S3/c1-17-23(25,18-2)21-13-5-9-15(10-6-13)27-16-11-7-14(8-12-16)22-24(26,19-3)20-4/h5-12H,1-4H3
47 atoms
S  -0.192529 -3.172112 -0.372752
S  -4.056683 2.484733 0.71005
S  5.916293 -0.480594 -2.072054
P  -5.459184 1.187106 0.685346
P  5.65169 0.619322 -0.53638
O  -5.097414 -0.288407 1.234131
O  4.12726 0.848305 -0.05481
O  -6.097914 0.828526 -0.731285
O  -6.756747 1.505671 1.557435
O  6.321358 0.146637 0.83446
O  6.16102 2.129393 -0.62272
C  -1.62575 -2.250964 0.104304
C  1.080413 -1.948599 -0.265788
C  -3.939042 -0.924955 0.846082
C  3.151264 -0.1125 -0.13524
C  -2.804553 -2.450598 -0.60354
C  0.957595 -0.709734 -0.888668
C  -1.616857 -1.383844 1.193086
C  2.250792 -2.258205 0.414837
C  -3.967524 -1.793914 -0.229769
C  1.986963 0.209965 -0.816726
C  -2.76745 -0.707613 1.554892
C  3.293606 -1.346559 0.47579
C  -6.342122 1.843659 -1.698715
C  -6.632217 2.03072 2.873736
C  7.681758 -0.273186 0.852351
C  5.952752 2.904633 -1.79632
H  -2.813412 -3.111408 -1.460418
H  0.052947 -0.460993 -1.427554
H  -0.704716 -1.224843 1.752611
H  2.347954 -3.214993 0.91049
H  -4.887398 -1.948214 -0.777414
H  1.894072 1.1764 -1.294121
H  -2.759739 -0.019576 2.388965
H  4.195689 -1.592087 1.01964
H  -7.172994 2.481933 -1.395339
H  -6.602365 1.337846 -2.624962
H  -5.455984 2.459494 -1.856791
H  -6.206871 1.291235 3.55438
H  -6.010134 2.926929 2.884467
H  -7.635741 2.281918 3.207916
H  7.866121 -0.701371 1.834337
H  7.873564 -1.025599 0.085895
H  8.353969 0.57242 0.700613
H  6.525286 3.820712 -1.673614
H  6.297393 2.376546 -2.686412
H  4.898683 3.15934 -1.91719
totalener: -2950.71140775 hartree
nucrepener: 3279.72351477 hartree
electener: -6230.43492252 hartree
twoeener: 4359.70712584 hartree
kineticenergy: 2942.65303421 hartree
xcener: -192.766451910157 hartree
chargesum: -0.0000000
charge: -0.023296 -0.397214 -0.376919 0.726832 0.701156 -0.339394 -0.320518 -0.319092 -0.311068 -0.317839 -0.316957 -0.004922 0.002143 0.242814 0.203571 -0.116170 -0.102713 -0.099867 -0.128398 -0.155736 -0.142456 -0.152658 -0.103448 -0.124440 -0.124320 -0.125939 -0.121563 0.115589 0.131208 0.130918 0.116410 0.128244 0.119187 0.119661 0.123720 0.114448 0.114459 0.112665 0.114041 0.110369 0.116968 0.116074 0.110538 0.116597 0.115884 0.109980 0.111454
qa: -0.0233 -0.3972 -0.3769 0.7268 0.7012 -0.3394 -0.3205 -0.3191 -0.3111 -0.3178 -0.3170 -0.0049 0.0021 0.2428 0.2036 -0.1162 -0.1027 -0.0999 -0.1284 -0.1557 -0.1425 -0.1527 -0.1034 -0.1244 -0.1243 -0.1259 -0.1216 0.1156 0.1312 0.1309 0.1164 0.1282 0.1192 0.1197 0.1237 0.1144 0.1145 0.1127 0.1140 0.1104 0.1170 0.1161 0.1105 0.1166 0.1159 0.1100 0.1115
va: 2.3571 2.0421 2.0592 5.5243 5.5307 2.1204 2.1382 2.1323 2.1190 2.1107 2.1174 3.8527 3.8380 3.8023 3.8615 3.9794 3.9573 3.9353 4.0267 4.0848 4.0354 4.0437 3.9968 3.8727 3.8692 3.8627 3.8697 1.0193 0.9973 0.9960 1.0208 1.0119 1.0082 1.0153 1.0163 0.9875 0.9911 1.0036 0.9877 1.0038 0.9914 0.9908 1.0042 0.9903 0.9910 1.0055 0.9875
dispcorr: -0.023045869 hartree
energy: -2950.734453617454
dipole: -0.10964 -0.14495 -0.25459 8.36441 -7.46153 0.90288 0.79788 -0.46819 0.32968
magnitude: 0.99433 au
magnitude: 2.52739 debye
