program: Orca
programVersion: 5.0.2
elementType: S S S P P O O O O O O C C C C C C C C C C C C C C C C H H H H H H H H H H H H H H H H H H H H
charge: 0
multiplicity: 1
keywords: wb97x-d3
keywords: def2-TZVPP
keywords: def2/J RIJCOSX
keywords: DEFGRID2
keywords: scfconv7
keywords: smallprint printgap noloewdin
keywords: NOSOSCF
formula: C16H20O6P2S3
InChI: InChI=1/C16H20O6P2S3/c1-17-23(25,18-2)21-13-5-9-15(10-6-13)27-16-11-7-14(8-12-16)22-24(26,19-3)20-4/h5-12H,1-4H3
47 atoms
S  0.017104 -3.604455 -0.84825
S  -4.999784 1.515283 -1.449099
S  3.518169 2.197584 0.405878
P  -4.978224 1.226735 0.438654
P  4.993945 1.088608 -0.088933
O  -4.468555 -0.20901 0.966779
O  4.893148 -0.473694 0.309296
O  -6.379664 1.322433 1.195227
O  -4.064442 2.190018 1.322421
O  5.337436 0.976577 -1.642152
O  6.417491 1.448236 0.533893
C  -1.281724 -2.530027 -0.312387
C  1.455527 -2.645825 -0.479559
C  -3.402301 -0.928584 0.497865
C  3.749704 -1.19125 0.040899
C  -1.256931 -1.158833 -0.540926
C  1.629813 -2.033742 0.758574
C  -2.385093 -3.092232 0.318218
C  2.449054 -2.538202 -1.444219
C  -2.300136 -0.352774 -0.120001
C  2.765875 -1.288872 1.013075
C  -3.450452 -2.297552 0.705835
C  3.605371 -1.818699 -1.183226
C  -7.561872 0.785392 0.614039
C  -4.0561 3.594334 1.090393
C  5.240722 2.108416 -2.498635
C  6.539038 1.797545 1.907954
H  -0.409309 -0.704175 -1.036035
H  0.863731 -2.119847 1.517555
H  -2.412457 -4.155998 0.514964
H  2.3126 -3.003094 -2.41166
H  -2.242421 0.712719 -0.291308
H  2.894088 -0.788877 1.963283
H  -4.310969 -2.735565 1.193575
H  4.381339 -1.734164 -1.931728
H  -7.691384 1.131501 -0.412221
H  -8.394875 1.130558 1.221181
H  -7.542831 -0.305268 0.62268
H  -3.895612 3.820493 0.03526
H  -4.991829 4.050444 1.41609
H  -3.237685 4.003958 1.676798
H  6.040769 2.821647 -2.296164
H  5.341635 1.740242 -3.516394
H  4.278156 2.608099 -2.385836
H  6.363566 0.933022 2.550053
H  7.558103 2.146188 2.054964
H  5.840844 2.59112 2.177673
totalener: -2950.71087781 hartree
nucrepener: 3324.33960575 hartree
electener: -6275.05048356 hartree
twoeener: 4404.29318280 hartree
kineticenergy: 2942.66113670 hartree
xcener: -192.771227208267 hartree
chargesum: 0.0000000
charge: -0.021413 -0.384544 -0.396669 0.699059 0.726237 -0.302979 -0.337636 -0.317971 -0.309932 -0.320418 -0.310981 0.005176 0.007346 0.251380 0.233419 -0.148233 -0.115283 -0.111342 -0.116526 -0.104748 -0.142178 -0.169760 -0.150130 -0.124770 -0.125653 -0.122274 -0.123268 0.133665 0.132607 0.113864 0.117253 0.101641 0.119386 0.119176 0.129272 0.111455 0.115950 0.112628 0.108991 0.116456 0.119625 0.114923 0.113651 0.113077 0.114246 0.117175 0.109049
qa: -0.0214 -0.3845 -0.3967 0.6991 0.7262 -0.3030 -0.3376 -0.3180 -0.3099 -0.3204 -0.3110 0.0052 0.0073 0.2514 0.2334 -0.1482 -0.1153 -0.1113 -0.1165 -0.1047 -0.1422 -0.1698 -0.1501 -0.1248 -0.1257 -0.1223 -0.1233 0.1337 0.1326 0.1139 0.1173 0.1016 0.1194 0.1192 0.1293 0.1115 0.1160 0.1126 0.1090 0.1165 0.1196 0.1149 0.1137 0.1131 0.1142 0.1172 0.1090
va: 2.3723 2.0491 2.0433 5.5401 5.5242 2.1777 2.1215 2.1248 2.1037 2.1279 2.1219 3.8553 3.8392 3.8331 3.8184 4.0035 3.9424 3.9960 3.9962 3.9485 4.0322 4.0371 4.0719 3.8707 3.8600 3.8711 3.8682 0.9973 0.9967 1.0180 1.0192 1.0370 1.0134 1.0122 1.0127 1.0045 0.9905 0.9877 1.0059 0.9906 0.9900 0.9877 0.9911 1.0037 0.9878 0.9913 1.0045
dispcorr: -0.023031985 hartree
energy: -2950.733909797337
dipole: 0.64579 -0.36867 0.27712 9.09751 -8.36671 0.73080 2.27067 -1.74786 0.52281
magnitude: 0.94032 au
magnitude: 2.39009 debye
