program: Orca
programVersion: 5.0.2
elementType: S P O O O N N C C C C C C C C C C C C C H H H H H H H H H H H H H H H H H H H H H H H
charge: 0
multiplicity: 1
keywords: wb97x-d3
keywords: def2-TZVPP
keywords: def2/J RIJCOSX
keywords: DEFGRID2
keywords: scfconv7
keywords: smallprint printgap noloewdin
keywords: NOSOSCF
formula: C13H23N2O3PS
InChI: InChI=1/C13H23N2O3PS/c1-7-16-19(20,17-10(2)3)18-11-8-14-12(15-9-11)13(4,5)6/h8-10H,7H2,1-6H3
43 atoms
S  1.539131 0.22721 1.904886
P  1.769373 -0.072315 0.025416
O  3.051989 0.534557 -0.679848
O  0.606095 0.539637 -0.934638
O  1.766985 -1.580437 -0.475241
N  -2.744172 1.082179 0.288966
N  -2.653711 -1.012767 -0.773081
C  -4.763154 -0.308932 0.197703
C  -5.415221 0.887919 0.88312
C  -4.849992 -1.525791 1.12702
C  -5.513566 -0.608065 -1.104623
C  -3.301641 -0.053642 -0.112537
C  3.745659 1.724649 -0.210592
C  -0.716836 0.321801 -0.643837
C  -1.457233 1.269333 0.030563
C  -1.372786 -0.830101 -1.039951
C  5.109769 1.700019 -0.859807
C  2.948193 2.963957 -0.551946
C  2.373832 -2.651036 0.279554
C  3.880696 -2.577899 0.282941
H  -5.387468 1.783196 0.261222
H  -4.942223 1.126337 1.835826
H  -6.463264 0.660084 1.084847
H  -4.311617 -1.352215 2.060904
H  -5.892412 -1.730244 1.377688
H  -4.438703 -2.421216 0.661115
H  -5.120262 -1.491052 -1.606932
H  -5.456046 0.231384 -1.80025
H  -6.568375 -0.789627 -0.891392
H  3.854645 1.640513 0.87367
H  -1.00724 2.200093 0.359101
H  -0.857284 -1.612059 -1.586653
H  5.654686 0.789413 -0.609815
H  5.037477 1.777377 -1.945665
H  5.694668 2.546521 -0.501387
H  1.989357 2.990036 -0.03253
H  2.766781 3.035671 -1.625109
H  3.506752 3.848068 -0.244685
H  1.975636 -2.642994 1.295741
H  2.029228 -3.559866 -0.20952
H  4.272298 -3.477631 0.757762
H  4.283042 -2.532385 -0.728867
H  4.252973 -1.722587 0.847522
elementType: S P O N C H
totalener: -1584.18685456 hartree
nucrepener: 2000.56537467 hartree
electener: -3584.75222923 hartree
oneelecener: -6150.45746521 hartree
twoeener: 2565.70523598 hartree
cpcmener: -0.02194900 hartree
kineticenergy: 1578.93637682 hartree
xcener: -118.042331448828 hartree
chargesum: 0.0000000
charge: -0.442410 0.751412 -0.346007 -0.358878 -0.352839 -0.351148 -0.396999 0.294115 -0.324916 -0.339088 -0.337474 0.255145 0.147361 0.215928 -0.004741 0.009861 -0.249667 -0.239949 0.033838 -0.238483 0.094600 0.091634 0.099145 0.104753 0.097520 0.095233 0.094139 0.104005 0.096961 0.075001 0.142896 0.142254 0.098311 0.091254 0.093147 0.082462 0.093847 0.101090 0.094779 0.110001 0.101180 0.092165 0.078561
qa: -0.4424 0.7514 -0.3460 -0.3589 -0.3528 -0.3511 -0.3970 0.2941 -0.3249 -0.3391 -0.3375 0.2551 0.1474 0.2159 -0.0047 0.0099 -0.2497 -0.2399 0.0338 -0.2385 0.0946 0.0916 0.0991 0.1048 0.0975 0.0952 0.0941 0.1040 0.0970 0.0750 0.1429 0.1423 0.0983 0.0913 0.0931 0.0825 0.0938 0.1011 0.0948 0.1100 0.1012 0.0922 0.0786
va: 1.9867 5.5110 2.1143 2.0971 2.1187 3.0762 3.0522 3.6212 3.9269 3.9343 3.9299 3.9499 3.8173 3.7311 4.1118 4.1321 3.9341 3.8948 3.8556 3.9024 1.0108 1.0127 1.0029 1.0024 1.0029 1.0163 1.0189 1.0025 1.0031 1.0215 1.0055 1.0110 1.0063 1.0065 1.0055 1.0185 1.0092 1.0086 1.0106 0.9914 1.0089 1.0059 1.0137
dispcorr: -0.020947587 hartree
energy: -1584.207802143586
dipole: -6.26031 7.95462 1.69430 -0.67114 0.47021 -0.20093 -0.49419 -0.02082 -0.51502
magnitude: 1.78221 au
magnitude: 4.53001 debye
