program: Orca
programVersion: 5.0.2
elementType: S P O O O N N C C C C C C C C C C C C C H H H H H H H H H H H H H H H H H H H H H H H
charge: 0
multiplicity: 1
keywords: wb97x-d3
keywords: def2-TZVPP
keywords: def2/J RIJCOSX
keywords: DEFGRID2
keywords: scfconv7
keywords: smallprint printgap noloewdin
keywords: NOSOSCF
formula: C13H23N2O3PS
InChI: InChI=1/C13H23N2O3PS/c1-7-16-19(20,17-10(2)3)18-11-8-14-12(15-9-11)13(4,5)6/h8-10H,7H2,1-6H3
43 atoms
S  3.530955 -0.308017 1.637797
P  2.072446 0.134836 0.478758
O  2.121548 1.526362 -0.282764
O  0.687124 0.312593 1.306592
O  1.728919 -0.888677 -0.693148
N  -2.784893 -0.560677 1.236412
N  -2.255726 0.394812 -0.838993
C  -4.560422 -0.323505 -0.404837
C  -5.406613 0.631233 0.447344
C  -5.007445 -1.766726 -0.15107
C  -4.772134 0.005597 -1.879804
C  -3.111202 -0.158196 0.008101
C  3.334001 2.083701 -0.864533
C  -0.579635 0.168587 0.805033
C  -1.534494 -0.4071 1.626812
C  -0.998238 0.566605 -0.449412
C  3.761261 1.291048 -2.081026
C  3.01398 3.524701 -1.186605
C  1.894888 -2.318038 -0.572346
C  0.806124 -2.959478 0.25082
H  -5.326595 0.402805 1.510314
H  -6.458691 0.549692 0.167937
H  -5.103931 1.669866 0.300965
H  -4.932085 -2.039916 0.900612
H  -6.049448 -1.889453 -0.451696
H  -4.410986 -2.4761 -0.728014
H  -5.825209 -0.130904 -2.131646
H  -4.191857 -0.647891 -2.53233
H  -4.510386 1.036136 -2.117524
H  4.114587 2.041788 -0.10031
H  -1.272808 -0.739943 2.625704
H  -0.332329 1.037123 -1.162668
H  4.622446 1.777319 -2.539093
H  4.062367 0.274017 -1.829302
H  2.964977 1.24711 -2.825164
H  2.685969 4.069534 -0.301424
H  2.238455 3.598236 -1.950505
H  3.908318 4.016674 -1.567203
H  1.875127 -2.684907 -1.596552
H  2.881676 -2.529751 -0.157492
H  0.945616 -4.040685 0.230358
H  0.838347 -2.64522 1.294821
H  -0.183485 -2.74394 -0.151998
elementType: S P O N C H
totalener: -1584.18480904 hartree
nucrepener: 2015.35432371 hartree
electener: -3599.53913275 hartree
oneelecener: -6179.42669684 hartree
twoeener: 2579.88756409 hartree
cpcmener: -0.02233496 hartree
kineticenergy: 1578.91091672 hartree
xcener: -118.040307161247 hartree
chargesum: 0.0000000
charge: -0.427392 0.697490 -0.327640 -0.333927 -0.332103 -0.391680 -0.355605 0.291309 -0.341449 -0.336858 -0.324088 0.247839 0.128609 0.189648 0.001389 0.027875 -0.244829 -0.251860 0.035755 -0.238233 0.096107 0.098039 0.105306 0.092751 0.097126 0.103533 0.099266 0.096602 0.089616 0.079366 0.139901 0.126426 0.101391 0.086064 0.095929 0.098598 0.091755 0.092799 0.111352 0.099158 0.112478 0.084339 0.087844
qa: -0.4274 0.6975 -0.3276 -0.3339 -0.3321 -0.3917 -0.3556 0.2913 -0.3414 -0.3369 -0.3241 0.2478 0.1286 0.1896 0.0014 0.0279 -0.2448 -0.2519 0.0358 -0.2382 0.0961 0.0980 0.1053 0.0928 0.0971 0.1035 0.0993 0.0966 0.0896 0.0794 0.1399 0.1264 0.1014 0.0861 0.0959 0.0986 0.0918 0.0928 0.1114 0.0992 0.1125 0.0843 0.0878
va: 2.0343 5.5190 2.1099 2.1182 2.0479 3.0479 3.0849 3.6239 3.9331 3.9284 3.9256 3.9609 3.8368 3.7733 4.0828 4.0349 3.8830 3.9330 3.8298 3.9014 1.0146 1.0028 1.0029 1.0202 1.0031 1.0028 1.0028 1.0099 1.0146 1.0202 1.0096 1.0330 1.0083 1.0194 1.0068 1.0086 1.0047 1.0054 0.9919 1.0128 1.0098 1.0127 1.0040
dispcorr: -0.021904921 hartree
energy: -1584.206713963126
dipole: -18.53732 18.88884 0.35152 -1.57036 1.32153 -0.24882 -15.26361 13.85428 -1.40932
magnitude: 1.47366 au
magnitude: 3.74574 debye
