program: Orca
programVersion: 5.0.2
elementType: S P O O O N N C C C C C C C C C C C C C H H H H H H H H H H H H H H H H H H H H H H H
charge: 0
multiplicity: 1
keywords: wb97x-d3
keywords: def2-TZVPP
keywords: def2/J RIJCOSX
keywords: DEFGRID2
keywords: scfconv7
keywords: smallprint printgap noloewdin
keywords: NOSOSCF
formula: C13H23N2O3PS
InChI: InChI=1/C13H23N2O3PS/c1-7-16-19(20,17-10(2)3)18-11-8-14-12(15-9-11)13(4,5)6/h8-10H,7H2,1-6H3
43 atoms
S  1.696836 -0.382956 1.923584
P  1.847887 -0.358406 0.012132
O  2.059203 1.039202 -0.706085
O  0.538196 -0.891706 -0.791808
O  2.965164 -1.259661 -0.661356
N  -3.033654 -1.0991 -0.718178
N  -2.423135 0.937121 0.272102
C  -4.800742 0.370323 0.075967
C  -5.003571 1.676416 0.838046
C  -5.457937 -0.768079 0.862989
C  -5.46167 0.488906 -1.302635
C  -3.330449 0.057714 -0.125303
C  2.834538 2.130569 -0.128768
C  -0.749892 -0.521631 -0.52551
C  -1.76081 -1.388157 -0.909689
C  -1.140061 0.661438 0.072326
C  4.313884 1.834336 -0.235415
C  2.425759 3.377524 -0.877073
C  3.368544 -2.539726 -0.114108
C  4.660922 -2.402281 0.646616
H  -4.555729 1.646279 1.831741
H  -6.072622 1.855346 0.965383
H  -4.588947 2.533643 0.30788
H  -5.392328 -1.720534 0.338413
H  -4.99709 -0.890879 1.845173
H  -6.515298 -0.547514 1.019743
H  -5.377506 -0.435498 -1.873821
H  -5.011244 1.291264 -1.890381
H  -6.523447 0.715926 -1.190287
H  2.546665 2.222712 0.921673
H  -1.522659 -2.332023 -1.389218
H  -0.432698 1.416275 0.394607
H  4.878658 2.68869 0.138248
H  4.606083 0.968422 0.360091
H  4.610073 1.662408 -1.270925
H  2.693017 3.317003 -1.932976
H  2.940505 4.237722 -0.449602
H  1.353611 3.558016 -0.796487
H  2.579121 -2.948635 0.518487
H  3.480918 -3.199304 -0.972859
H  4.983075 -3.387975 0.983395
H  5.450897 -1.989444 0.019337
H  4.542496 -1.769246 1.525597
elementType: S P O N C H
totalener: -1584.18527781 hartree
nucrepener: 1989.24677499 hartree
electener: -3573.43205280 hartree
oneelecener: -6127.66330691 hartree
twoeener: 2554.23125411 hartree
cpcmener: -0.02227273 hartree
kineticenergy: 1578.91587971 hartree
xcener: -118.040594236350 hartree
chargesum: 0.0000000
charge: -0.439453 0.741893 -0.347607 -0.327100 -0.350954 -0.396058 -0.354485 0.293834 -0.325703 -0.336800 -0.340042 0.243691 0.143659 0.236383 -0.008893 0.015138 -0.241526 -0.249669 0.050977 -0.249180 0.094401 0.099203 0.090654 0.092760 0.103844 0.096763 0.095228 0.105034 0.097569 0.077766 0.139738 0.110831 0.100990 0.083832 0.095239 0.091373 0.092855 0.098634 0.091497 0.108876 0.103368 0.092517 0.078919
qa: -0.4395 0.7419 -0.3476 -0.3271 -0.3510 -0.3961 -0.3545 0.2938 -0.3257 -0.3368 -0.3400 0.2437 0.1437 0.2364 -0.0089 0.0151 -0.2415 -0.2497 0.0510 -0.2492 0.0944 0.0992 0.0907 0.0928 0.1038 0.0968 0.0952 0.1050 0.0976 0.0778 0.1397 0.1108 0.1010 0.0838 0.0952 0.0914 0.0929 0.0986 0.0915 0.1089 0.1034 0.0925 0.0789
va: 1.9788 5.5122 2.1043 2.1508 2.1059 3.0499 3.0917 3.6206 3.9276 3.9313 3.9340 3.9626 3.8134 3.7235 4.1018 4.0558 3.9154 3.9293 3.8382 3.9170 1.0109 1.0026 1.0132 1.0192 1.0023 1.0030 1.0163 1.0024 1.0028 1.0202 1.0077 1.0293 1.0088 1.0129 1.0081 1.0061 1.0056 1.0058 1.0103 0.9969 1.0096 1.0023 1.0153
dispcorr: -0.020618694 hartree
energy: -1584.205896502446
dipole: -7.35343 9.03902 1.68559 8.57336 -8.54468 0.02868 -0.65825 0.07432 -0.58393
magnitude: 1.78410 au
magnitude: 4.53482 debye
