program: Orca
programVersion: 5.0.2
elementType: S P O O O N N C C C C C C C C C C C C C H H H H H H H H H H H H H H H H H H H H H H H
charge: 0
multiplicity: 1
keywords: wb97x-d3
keywords: def2-TZVPP
keywords: def2/J RIJCOSX
keywords: DEFGRID2
keywords: scfconv7
keywords: smallprint printgap noloewdin
keywords: NOSOSCF
formula: C13H23N2O3PS
InChI: InChI=1/C13H23N2O3PS/c1-7-16-19(20,17-10(2)3)18-11-8-14-12(15-9-11)13(4,5)6/h8-10H,7H2,1-6H3
43 atoms
S  1.674547 0.54361 1.859113
P  1.960768 -0.071706 0.0666
O  3.11286 0.621097 -0.773244
O  0.704778 0.09735 -0.949806
O  2.260655 -1.614958 -0.157563
N  -2.402909 -1.096377 0.49803
N  -2.831745 0.660006 -0.997233
C  -4.708635 -0.37574 0.182272
C  -5.117849 -1.839267 0.358877
C  -5.564159 0.243443 -0.921688
C  -4.950544 0.38367 1.493929
C  -3.230131 -0.271274 -0.137276
C  3.493223 2.019627 -0.634382
C  -0.610843 -0.048102 -0.618377
C  -1.10523 -0.99749 0.259288
C  -1.534785 0.776845 -1.230199
C  4.808963 2.165918 -1.362806
C  2.414542 2.925753 -1.187239
C  3.258302 -2.31206 0.624981
C  2.594922 -3.224038 1.623798
H  -6.188981 -1.899313 0.558794
H  -4.600053 -2.316372 1.189167
H  -4.917626 -2.421683 -0.542554
H  -5.397044 -0.243425 -1.883926
H  -6.619498 0.122999 -0.671499
H  -5.376111 1.308617 -1.046725
H  -4.38075 -0.046158 2.319028
H  -6.007834 0.340971 1.762578
H  -4.672469 1.435344 1.404356
H  3.636021 2.219507 0.430676
H  -0.458415 -1.702555 0.770102
H  -1.215301 1.540315 -1.93175
H  5.175161 3.185156 -1.244431
H  5.565753 1.491653 -0.961943
H  4.69687 1.97116 -2.430391
H  2.200937 2.698179 -2.232361
H  2.754567 3.959815 -1.131378
H  1.487012 2.860734 -0.617374
H  3.85484 -2.874452 -0.091583
H  3.92306 -1.603205 1.122972
H  3.359558 -3.800823 2.144414
H  2.033063 -2.659799 2.367763
H  1.920885 -3.927426 1.134738
elementType: S P O N C H
totalener: -1584.18534531 hartree
nucrepener: 1992.30232197 hartree
electener: -3576.48766728 hartree
oneelecener: -6133.82054341 hartree
twoeener: 2557.33287612 hartree
cpcmener: -0.02233252 hartree
kineticenergy: 1578.92290638 hartree
xcener: -118.041580963209 hartree
chargesum: -0.0000000
charge: -0.440240 0.746537 -0.348476 -0.330662 -0.349243 -0.387924 -0.368145 0.271352 -0.323929 -0.317486 -0.339787 0.251017 0.141894 0.230234 0.011001 0.003993 -0.250691 -0.244000 0.041842 -0.246459 0.097455 0.089287 0.101746 0.100331 0.098299 0.087026 0.099442 0.099744 0.104071 0.075475 0.123049 0.139190 0.091386 0.098087 0.090807 0.094550 0.101853 0.082979 0.108032 0.093078 0.104576 0.077414 0.091295
qa: -0.4402 0.7465 -0.3485 -0.3307 -0.3492 -0.3879 -0.3681 0.2714 -0.3239 -0.3175 -0.3398 0.2510 0.1419 0.2302 0.0110 0.0040 -0.2507 -0.2440 0.0418 -0.2465 0.0975 0.0893 0.1017 0.1003 0.0983 0.0870 0.0994 0.0997 0.1041 0.0755 0.1230 0.1392 0.0914 0.0981 0.0908 0.0945 0.1019 0.0830 0.1080 0.0931 0.1046 0.0774 0.0913
va: 1.9777 5.5084 2.1355 2.1203 2.0956 3.0756 3.0726 3.6446 3.9180 3.9182 3.9329 3.9564 3.8335 3.7233 4.0937 4.0850 3.9347 3.8759 3.8664 3.9135 1.0034 1.0222 1.0056 1.0081 1.0032 1.0192 1.0100 1.0021 1.0051 1.0196 1.0189 1.0074 1.0050 1.0083 1.0064 1.0088 1.0088 1.0208 0.9965 1.0049 1.0089 1.0156 1.0028
dispcorr: -0.020684446 hartree
energy: -1584.206029761112
dipole: -10.77936 12.54595 1.76659 0.49116 -0.43774 0.05341 -0.16776 -0.38499 -0.55275
magnitude: 1.85181 au
magnitude: 4.70694 debye
