program: Orca
programVersion: 5.0.2
elementType: S P O O O N N C C C C C C C C C C C C C H H H H H H H H H H H H H H H H H H H H H H H
charge: 0
multiplicity: 1
keywords: wb97x-d3
keywords: def2-TZVPP
keywords: def2/J RIJCOSX
keywords: DEFGRID2
keywords: scfconv7
keywords: smallprint printgap noloewdin
keywords: NOSOSCF
formula: C13H23N2O3PS
InChI: InChI=1/C13H23N2O3PS/c1-7-16-19(20,17-10(2)3)18-11-8-14-12(15-9-11)13(4,5)6/h8-10H,7H2,1-6H3
43 atoms
S  1.541101 -0.490072 1.966889
P  2.133194 -0.347867 0.148145
O  2.850774 0.996473 -0.295344
O  0.939409 -0.544799 -0.9539
O  3.226149 -1.357687 -0.393245
N  -2.323557 0.987711 -0.860578
N  -2.430103 -1.095355 0.220773
C  -4.453409 0.241023 0.097136
C  -5.00674 1.491197 -0.58139
C  -4.606864 0.386033 1.616446
C  -5.24684 -0.977534 -0.385578
C  -2.98318 0.038103 -0.209717
C  2.248054 2.296197 -0.019532
C  -0.385031 -0.343609 -0.675655
C  -1.030515 0.801581 -1.089959
C  -1.144397 -1.289268 -0.009451
C  3.043183 2.963021 1.078398
C  2.245521 3.070523 -1.316682
C  3.321624 -2.728888 0.049053
C  2.309304 -3.619328 -0.62647
H  -6.067551 1.59016 -0.345203
H  -4.915539 1.442025 -1.667139
H  -4.50863 2.400106 -0.244455
H  -4.052899 1.249016 1.99064
H  -5.657517 0.527456 1.87543
H  -4.250598 -0.498035 2.145433
H  -5.145738 -1.115123 -1.463949
H  -6.307097 -0.84104 -0.167056
H  -4.923632 -1.895585 0.10308
H  1.217013 2.156271 0.319467
H  -0.497588 1.581418 -1.624427
H  -0.706123 -2.220373 0.332484
H  2.620119 3.944494 1.291084
H  3.013112 2.3799 1.998473
H  4.084734 3.100442 0.784401
H  1.782172 4.043744 -1.157936
H  1.678659 2.551643 -2.089948
H  3.260431 3.236278 -1.680656
H  4.336084 -3.028314 -0.204853
H  3.221551 -2.767476 1.135327
H  1.29052 -3.405481 -0.303456
H  2.360291 -3.53109 -1.711524
H  2.525524 -4.655323 -0.365942
elementType: S P O N C H
totalener: -1584.18481604 hartree
nucrepener: 2020.17952705 hartree
electener: -3604.36434309 hartree
oneelecener: -6189.14786351 hartree
twoeener: 2584.78352042 hartree
cpcmener: -0.02549821 hartree
kineticenergy: 1578.93051291 hartree
xcener: -118.042911542971 hartree
chargesum: 0.0000000
charge: -0.444323 0.751111 -0.356329 -0.363196 -0.344089 -0.358304 -0.395889 0.290118 -0.323495 -0.339534 -0.336529 0.252012 0.142975 0.247952 0.005092 0.004376 -0.245498 -0.253265 0.042154 -0.244941 0.099528 0.094682 0.090055 0.104866 0.097927 0.096116 0.103600 0.096568 0.093669 0.065300 0.146337 0.133892 0.097844 0.085558 0.094243 0.097962 0.095034 0.098121 0.110291 0.092214 0.083002 0.092112 0.100684
qa: -0.4443 0.7511 -0.3563 -0.3632 -0.3441 -0.3583 -0.3959 0.2901 -0.3235 -0.3395 -0.3365 0.2520 0.1430 0.2480 0.0051 0.0044 -0.2455 -0.2533 0.0422 -0.2449 0.0995 0.0947 0.0901 0.1049 0.0979 0.0961 0.1036 0.0966 0.0937 0.0653 0.1463 0.1339 0.0978 0.0856 0.0942 0.0980 0.0950 0.0981 0.1103 0.0922 0.0830 0.0921 0.1007
va: 1.9780 5.5189 2.1053 2.0601 2.1240 3.0811 3.0659 3.6259 3.9275 3.9336 3.9283 3.9540 3.8463 3.6791 4.0894 4.1130 3.9405 3.9334 3.8467 3.9119 1.0024 1.0108 1.0140 1.0029 1.0026 1.0153 1.0024 1.0034 1.0204 1.0071 1.0032 1.0072 1.0057 1.0193 1.0076 1.0050 1.0094 1.0075 0.9913 1.0116 1.0005 1.0063 1.0093
dispcorr: -0.021722147 hartree
energy: -1584.206538191763
dipole: -16.87280 17.44736 0.57456 6.70479 -6.62951 0.07528 -1.62211 0.89452 -0.72759
magnitude: 0.93015 au
magnitude: 2.36424 debye
