program: Gaussian 09
title: 000066638
version: EM64L-G09RevD.01
frameworkgroup: C1[X(C10H10N2O4S)]
method: RPBEPBE
basis: SDD
operation: Freq
keyword: #p
keyword: freq=noraman
keyword: PBEPBE/SDD
title: #p freq=noraman PBEPBE/SDD
converged: NO YES NO NO
title: Mulliken charges:
elementType: S O O O O N N C C C C C C C C C C H H H H H H H H H H
charge: 0.991111 -0.216890 -0.568941 -0.504917 -0.506232 -0.288473 -0.039186 -0.644874 0.439337 0.241281 0.192372 -0.081800 -0.326519 -0.358162 -0.224684 -0.207294 -0.751786 0.282724 0.282666 0.313493 0.294109 0.281982 0.282553 0.239454 0.258255 0.239355 0.381065
chargesum: 0.00000
title: Mulliken charges with hydrogens summed into heavy atoms:
elementType: S O O O O N N C C C C C C C C C C
charge: 0.991111 -0.216890 -0.187877 -0.504917 -0.506232 -0.288473 -0.039186 -0.079484 0.439337 0.241281 0.192372 -0.081800 -0.013026 -0.064053 0.057299 0.075259 -0.014721
polarizability: 2.74860030e+02 -1.26211347e-01 1.55614919e+02 7.87138282e-01 2.38232864e-01 8.96822631e+01
1716.lowfreq: -4.7649 -0.0006 0.0011 0.0026 2.3370 6.1750 24.4784 43.6244 62.2116
frequency: 24.4306 43.6169 62.2002 88.4278 106.9933 136.7730 147.7574 154.8985 171.3895 178.9981 195.1950 269.7553 288.5564 297.5546 323.2999 334.6098 369.1882 389.7788 392.7914 417.2160 444.5557 467.0513 515.9027 553.8767 559.5554 579.3342 591.9481 617.9231 689.2561 736.4090 762.7073 833.1606 850.4836 863.4008 891.8291 892.9376 939.3892 965.9132 986.2469 988.6074 993.4056 1001.2652 1031.0201 1038.2932 1045.2122 1059.8982 1125.2849 1125.8318 1143.2726 1185.4834 1195.0016 1299.2893 1308.7357 1365.6315 1389.2246 1403.9993 1404.6114 1417.1227 1452.8505 1457.8356 1481.3184 1578.1834 1592.9618 1596.1495 1647.4106 2981.5952 3018.3046 3056.7268 3071.1449 3112.3968 3162.7660 3163.8876 3193.0490 3198.9216 3479.4358
redmass: 7.4900 5.6348 4.0613 6.6067 4.3564 2.8061 1.2337 5.2279 1.5661 5.9192 6.4097 3.2346 5.6403 4.3946 9.0640 5.6532 6.8396 5.9029 6.3190 2.9990 2.3125 7.8482 3.9706 5.5523 6.7556 5.4139 4.4111 7.1307 7.2997 3.8218 6.1500 13.0877 1.2576 1.5082 3.3718 1.8930 6.0824 17.1989 2.0724 2.0016 2.3097 1.3424 1.5154 5.6540 1.2512 2.0997 1.2796 1.2910 5.0132 1.1932 1.4906 1.2917 3.9452 2.9307 6.7280 1.2267 1.3918 3.3103 1.1208 1.0459 2.7004 6.1531 7.0712 5.9008 12.1278 1.0380 1.0620 1.0970 1.0993 1.0985 1.0912 1.0913 1.0954 1.0947 1.0661
irintensity: 1.7538 0.4799 1.0160 0.4588 2.4727 5.2899 2.3636 14.7562 41.3788 6.9306 4.7504 44.8259 16.1127 15.1791 24.0931 8.4720 61.4692 0.5586 9.0483 0.0869 0.1743 18.0810 30.2150 54.1719 131.6631 32.6309 10.1813 0.8925 32.6784 0.8895 16.0585 93.5492 3.3400 73.4875 17.1886 0.4823 4.8498 86.7508 2.4999 7.3173 5.7504 0.5592 7.1875 45.3178 54.3199 100.1403 0.0780 14.2792 37.6801 30.7416 15.4928 10.4755 200.4111 80.0783 0.4354 19.7937 45.0247 20.9521 17.6750 19.4012 184.5919 3.0044 13.2746 183.3029 226.7615 20.5363 0.1665 11.3137 0.6437 7.4187 1.5062 4.2615 6.1495 0.0700 41.4353
temp: 298.150 k
press: 1.00000 atm
elementType: 16 8 8 8 8 7 7 6 6 6 6 6 6 6 6 6 6 1 1 1 1 1 1 1 1 1 1
symmnumber: 1
zpe: 495860.7 jmol-1
zpe.correction: 0.188863 hartree
zpe.thermalcorrener: 0.205554 hartree
zpe.thermalcorrenthalpy: 0.206498 hartree
zpe.thermalcorrgfe: 0.143520 hartree
zpe.sumelectzpe: -1194.096005 hartree
zpe.sumelectthermal: -1194.079314 hartree
zpe.sumelectthermalent: -1194.078370 hartree
zpe.sumelectthermalfe: -1194.141348 hartree
dipole: 8.4078 -1.9031 1.4295
dipole: 8.7382
quadrupole: -86.5439 -113.6320 -109.1376
quadrupole: -8.4805 -10.4938 -0.5296
quadrupole: 16.5606 -10.5275 -6.0331 -8.4805 -10.4938 -0.5296
hfenergy: -1194.284868 hartree
pointgroup: C01 [X(C10H10N2O4S1)]
dipole: 3.3171471 0.7677187 -0.4754816 debye
polarizability: 274.8555744|-0.9728116|154.9635699|-0.032934|6.5641424|90.3380681 unknown
InChI: InChI=1S/C10H10N2O4S/c1-7-6-10(13)12(11-7)8-2-4-9(5-3-8)17(14,15)16/h2-5,14H,6H2,1H3
charge 0 multiplicity 1
27 atoms
S  -4.066708 0.16847 0.074244
O  2.465445 -2.519041 -0.310933
O  -4.310029 0.356792 -1.762151
O  -4.709441 -1.245305 0.528039
O  -4.524456 1.546491 0.790568
N  1.979373 -0.185317 -0.060698
N  2.72173 1.043914 0.056768
C  4.247012 -0.748669 -0.150827
C  0.561017 -0.118081 -0.034658
C  4.005878 0.736338 0.00731
C  2.823777 -1.320817 -0.191045
C  -2.209314 0.053833 0.018962
C  -0.218844 -1.304288 -0.1396
C  -0.064784 1.151612 0.104908
C  -1.623637 -1.21478 -0.115898
C  -1.467681 1.241887 0.128632
C  5.064489 1.791249 0.104203
H  4.794168 -1.003013 -1.076767
H  4.817231 -1.18697 0.688389
H  0.273654 -2.272961 -0.241155
H  0.555633 2.04528 0.189074
H  -2.245179 -2.112672 -0.184893
H  -1.971911 2.206023 0.244682
H  5.726794 1.60876 0.971436
H  4.605961 2.786916 0.213056
H  5.706475 1.792457 -0.796859
H  -5.295952 0.422294 -1.926487
