program: Orca
programVersion: 5.0.2
elementType: S P O O O N N C C C C C C C C C C C C C H H H H H H H H H H H H H H H H H H H H H H H
charge: 0
multiplicity: 1
keywords: wb97x-d3
keywords: def2-TZVPP
keywords: def2/J RIJCOSX
keywords: DEFGRID2
keywords: scfconv7
keywords: smallprint printgap noloewdin
keywords: NOSOSCF
formula: C13H23N2O3PS
InChI: InChI=1/C13H23N2O3PS/c1-7-16-19(20,17-10(2)3)18-11-8-14-12(15-9-11)13(4,5)6/h8-10H,7H2,1-6H3
43 atoms
S  3.451944 -0.275646 1.881306
P  1.922614 -0.067432 0.749342
O  1.814278 1.235865 -0.150042
O  0.565063 0.084296 1.628459
O  1.60843 -1.235894 -0.28672
N  -2.600693 -1.113679 0.366585
N  -2.514711 1.219821 0.105487
C  -4.533331 0.010146 -0.584862
C  -5.501529 -0.366433 0.544733
C  -4.606066 -1.048796 -1.689064
C  -4.946227 1.360067 -1.164689
C  -3.129513 0.049616 -0.013219
C  2.731205 1.480274 -1.257481
C  -0.677317 0.073888 1.037363
C  -1.385036 -1.104907 0.883274
C  -1.29509 1.236383 0.626577
C  1.887244 1.742536 -2.483182
C  3.624938 2.639366 -0.881852
C  2.197631 -2.553082 -0.22218
C  3.399815 -2.64111 -1.126935
H  -5.282525 -1.353181 0.953021
H  -6.525744 -0.383552 0.167529
H  -5.461222 0.355421 1.36274
H  -3.897757 -0.837564 -2.492493
H  -4.397238 -2.047949 -1.309194
H  -5.606494 -1.0611 -2.124665
H  -4.282394 1.681411 -1.968232
H  -4.964097 2.146205 -0.410428
H  -5.951925 1.28049 -1.580716
H  3.344961 0.589522 -1.424127
H  -0.963046 -2.054815 1.194927
H  -0.807748 2.19983 0.727623
H  1.249687 2.616864 -2.342408
H  2.532564 1.932012 -3.340494
H  1.256883 0.885487 -2.721553
H  4.309913 2.853409 -1.702071
H  4.221871 2.409187 0.000818
H  3.042034 3.54029 -0.685121
H  2.460129 -2.797289 0.808063
H  1.411912 -3.237059 -0.538738
H  3.793654 -3.657532 -1.099904
H  3.140274 -2.410164 -2.160015
H  4.193164 -1.966467 -0.804571
elementType: S P O N C H
totalener: -1584.18562362 hartree
nucrepener: 2010.75355552 hartree
electener: -3594.93917914 hartree
oneelecener: -6170.25244860 hartree
twoeener: 2575.31326946 hartree
cpcmener: -0.02425236 hartree
kineticenergy: 1578.90742084 hartree
xcener: -118.035261483614 hartree
chargesum: -0.0000000
charge: -0.430105 0.721763 -0.344099 -0.358814 -0.344008 -0.395205 -0.354175 0.292909 -0.340155 -0.335328 -0.322509 0.251724 0.147707 0.219027 -0.001467 0.002904 -0.258256 -0.243450 0.061020 -0.246127 0.096460 0.098429 0.105395 0.104167 0.092363 0.096792 0.097338 0.089372 0.098780 0.075603 0.144860 0.141602 0.092520 0.101413 0.095874 0.096804 0.083032 0.093212 0.090851 0.108989 0.103411 0.093001 0.076374
qa: -0.4301 0.7218 -0.3441 -0.3588 -0.3440 -0.3952 -0.3542 0.2929 -0.3402 -0.3353 -0.3225 0.2517 0.1477 0.2190 -0.0015 0.0029 -0.2583 -0.2434 0.0610 -0.2461 0.0965 0.0984 0.1054 0.1042 0.0924 0.0968 0.0973 0.0894 0.0988 0.0756 0.1449 0.1416 0.0925 0.1014 0.0959 0.0968 0.0830 0.0932 0.0909 0.1090 0.1034 0.0930 0.0764
va: 2.0157 5.5311 2.0844 2.1137 2.0550 3.0541 3.0701 3.6207 3.9353 3.9286 3.9252 3.9556 3.8483 3.7414 4.1134 4.0918 3.9277 3.9390 3.8080 3.9240 1.0140 1.0024 1.0028 1.0029 1.0205 1.0035 1.0097 1.0145 1.0031 0.9982 1.0040 1.0122 1.0060 1.0074 1.0115 1.0064 1.0194 1.0063 1.0144 0.9936 1.0102 1.0027 1.0151
dispcorr: -0.021421518 hartree
energy: -1584.207045138092
dipole: -14.29474 14.66179 0.36705 0.50680 -1.11565 -0.60885 -21.61286 19.75856 -1.85430
magnitude: 1.98592 au
magnitude: 5.04780 debye
