program: Orca
programVersion: 5.0.2
elementType: S P O O O N N C C C C C C C C C C C C C H H H H H H H H H H H H H H H H H H H H H H H
charge: 0
multiplicity: 1
keywords: wb97x-d3
keywords: def2-TZVPP
keywords: def2/J RIJCOSX
keywords: DEFGRID2
keywords: scfconv7
keywords: smallprint printgap noloewdin
keywords: NOSOSCF
formula: C13H23N2O3PS
InChI: InChI=1/C13H23N2O3PS/c1-7-16-19(20,17-10(2)3)18-11-8-14-12(15-9-11)13(4,5)6/h8-10H,7H2,1-6H3
43 atoms
S  3.472785 -0.533968 1.750674
P  1.905423 -0.239396 0.692948
O  1.731311 1.149451 -0.052976
O  0.571508 -0.215605 1.620051
O  1.586555 -1.296779 -0.455061
N  -2.47277 1.216018 0.283265
N  -2.644387 -1.127057 0.253508
C  -4.510056 0.174278 -0.597036
C  -5.523871 -0.378347 0.412109
C  -4.542624 -0.675845 -1.87158
C  -4.890963 1.609189 -0.949885
C  -3.125094 0.092759 0.013007
C  2.647032 1.606542 -1.089232
C  -0.679178 -0.103085 1.056864
C  -1.256284 1.12351 0.803084
C  -1.431528 -1.226758 0.767442
C  1.794629 2.203957 -2.184928
C  3.615474 2.59752 -0.483212
C  2.256547 -2.568332 -0.593313
C  3.436795 -2.452233 -1.522982
H  -5.517794 0.197885 1.339363
H  -5.322725 -1.420429 0.660122
H  -6.531135 -0.324318 -0.004948
H  -3.808459 -0.327884 -2.600919
H  -4.341122 -1.726063 -1.664154
H  -5.527735 -0.610793 -2.336632
H  -4.923629 2.257124 -0.074262
H  -5.884783 1.616447 -1.400697
H  -4.201172 2.051566 -1.669508
H  3.199352 0.749103 -1.485932
H  -0.738353 2.048711 1.029631
H  -1.046968 -2.221992 0.964534
H  2.433651 2.559261 -2.992931
H  1.104805 1.469486 -2.60052
H  1.218907 3.053844 -1.814318
H  4.292295 2.963136 -1.255326
H  4.218929 2.138912 0.29983
H  3.088757 3.455195 -0.062426
H  2.560222 -2.940349 0.385978
H  1.504283 -3.247374 -0.990929
H  3.137553 -2.088041 -2.505687
H  4.199908 -1.786621 -1.119152
H  3.886866 -3.436743 -1.653693
elementType: S P O N C H
totalener: -1584.18513587 hartree
nucrepener: 2013.26763225 hartree
electener: -3597.45276812 hartree
oneelecener: -6175.34078117 hartree
twoeener: 2577.88801305 hartree
cpcmener: -0.02372063 hartree
kineticenergy: 1578.92334570 hartree
xcener: -118.039034919336 hartree
chargesum: -0.0000000
charge: -0.430232 0.724003 -0.337809 -0.360175 -0.344574 -0.351769 -0.395399 0.296637 -0.339642 -0.338326 -0.324986 0.250017 0.143039 0.219718 0.002950 -0.003721 -0.259833 -0.247645 0.063198 -0.249754 0.105168 0.095438 0.098095 0.104496 0.094100 0.096816 0.091355 0.099330 0.095355 0.080267 0.141122 0.144758 0.101204 0.097547 0.092729 0.097568 0.083401 0.092718 0.089345 0.109792 0.092863 0.076166 0.104664
qa: -0.4302 0.7240 -0.3378 -0.3602 -0.3446 -0.3518 -0.3954 0.2966 -0.3396 -0.3383 -0.3250 0.2500 0.1430 0.2197 0.0030 -0.0037 -0.2598 -0.2476 0.0632 -0.2498 0.1052 0.0954 0.0981 0.1045 0.0941 0.0968 0.0914 0.0993 0.0954 0.0803 0.1411 0.1448 0.1012 0.0975 0.0927 0.0976 0.0834 0.0927 0.0893 0.1098 0.0929 0.0762 0.1047
va: 2.0128 5.5275 2.0898 2.1153 2.0578 3.0705 3.0514 3.6149 3.9339 3.9306 3.9275 3.9592 3.8514 3.7380 4.0829 4.1169 3.9280 3.9273 3.8082 3.9194 1.0026 1.0153 1.0025 1.0025 1.0190 1.0034 1.0132 1.0027 1.0106 0.9965 1.0135 1.0045 1.0070 1.0099 1.0058 1.0072 1.0234 1.0059 1.0150 0.9936 1.0026 1.0160 1.0102
dispcorr: -0.021329380 hartree
energy: -1584.206465251066
dipole: -14.04389 14.44324 0.39935 4.41769 -4.73650 -0.31881 -21.27583 19.38167 -1.89416
magnitude: 1.96187 au
magnitude: 4.98669 debye
