program: Orca
programVersion: 5.0.2
elementType: S P O O O N N C C C C C C C C C C C C C H H H H H H H H H H H H H H H H H H H H H H H
charge: 0
multiplicity: 1
keywords: wb97x-d3
keywords: def2-TZVPP
keywords: def2/J RIJCOSX
keywords: DEFGRID2
keywords: scfconv7
keywords: smallprint printgap noloewdin
keywords: NOSOSCF
formula: C13H23N2O3PS
InChI: InChI=1/C13H23N2O3PS/c1-7-16-19(20,17-10(2)3)18-11-8-14-12(15-9-11)13(4,5)6/h8-10H,7H2,1-6H3
43 atoms
S  3.476784 -0.52918 1.747421
P  1.910587 -0.232965 0.688419
O  1.731033 1.159425 -0.049048
O  0.576386 -0.222938 1.615369
O  1.601077 -1.278949 -0.472252
N  -2.480326 1.213168 0.314527
N  -2.630206 -1.130038 0.223237
C  -4.50762 0.175574 -0.593614
C  -5.513574 -0.450534 0.379554
C  -4.515879 -0.606835 -1.911558
C  -4.91763 1.618706 -0.873151
C  -3.122703 0.091264 0.016067
C  2.640156 1.619356 -1.090094
C  -0.674582 -0.109316 1.053497
C  -1.262517 1.117998 0.830787
C  -1.416242 -1.232091 0.734106
C  1.780683 2.221439 -2.177676
C  3.614606 2.60639 -0.487327
C  2.235875 -2.571211 -0.584362
C  3.436088 -2.497867 -1.492737
H  -6.520826 -0.390165 -0.036567
H  -5.519198 0.072334 1.337887
H  -5.294406 -1.501279 0.568514
H  -3.786762 -0.204738 -2.617773
H  -4.291346 -1.661935 -1.759516
H  -5.500284 -0.539642 -2.377865
H  -5.910174 1.628542 -1.326717
H  -4.235502 2.112152 -1.56623
H  -4.966662 2.219475 0.034874
H  3.1885 0.762645 -1.49375
H  -0.751866 2.041495 1.080063
H  -1.021842 -2.228641 0.903803
H  2.414304 2.578611 -2.989089
H  1.087192 1.488937 -2.5907
H  1.208469 3.070632 -1.800127
H  4.285916 2.974304 -1.263149
H  4.22355 2.143284 0.288827
H  3.092586 3.462926 -0.058496
H  2.511044 -2.94195 0.403865
H  1.47224 -3.233171 -0.98915
H  3.861256 -3.495704 -1.604377
H  3.165303 -2.136615 -2.484718
H  4.209427 -1.848828 -1.081622
elementType: S P O N C H
totalener: -1584.18524122 hartree
nucrepener: 2013.15648164 hartree
electener: -3597.34172286 hartree
oneelecener: -6175.10958828 hartree
twoeener: 2577.76786542 hartree
cpcmener: -0.02377490 hartree
kineticenergy: 1578.92290031 hartree
xcener: -118.038674576875 hartree
chargesum: -0.0000000
charge: -0.430239 0.724296 -0.338752 -0.359567 -0.344575 -0.351019 -0.395773 0.297690 -0.339466 -0.339546 -0.324750 0.250082 0.144343 0.220474 0.001648 -0.003227 -0.259692 -0.247261 0.061711 -0.248611 0.097792 0.105151 0.095020 0.105129 0.094197 0.097061 0.099138 0.094467 0.091759 0.078807 0.141225 0.144931 0.101025 0.097507 0.092691 0.097598 0.083287 0.092512 0.089857 0.109899 0.104148 0.092476 0.076558
qa: -0.4302 0.7243 -0.3388 -0.3596 -0.3446 -0.3510 -0.3958 0.2977 -0.3395 -0.3395 -0.3247 0.2501 0.1443 0.2205 0.0016 -0.0032 -0.2597 -0.2473 0.0617 -0.2486 0.0978 0.1052 0.0950 0.1051 0.0942 0.0971 0.0991 0.0945 0.0918 0.0788 0.1412 0.1449 0.1010 0.0975 0.0927 0.0976 0.0833 0.0925 0.0899 0.1099 0.1041 0.0925 0.0766
va: 2.0134 5.5281 2.0908 2.1151 2.0574 3.0703 3.0515 3.6145 3.9338 3.9319 3.9282 3.9590 3.8515 3.7387 4.0832 4.1165 3.9277 3.9266 3.8086 3.9205 1.0027 1.0025 1.0159 1.0022 1.0185 1.0032 1.0028 1.0109 1.0128 0.9975 1.0131 1.0042 1.0070 1.0099 1.0058 1.0072 1.0234 1.0060 1.0144 0.9936 1.0101 1.0028 1.0164
dispcorr: -0.021320848 hartree
energy: -1584.206562068091
dipole: -14.15232 14.52330 0.37098 4.33890 -4.66898 -0.33009 -21.15805 19.27405 -1.88401
magnitude: 1.94835 au
magnitude: 4.95230 debye
