program: Orca
programVersion: 5.0.2
elementType: S P O O O N N C C C C C C C C C C C C C H H H H H H H H H H H H H H H H H H H H H H H
charge: 0
multiplicity: 1
keywords: wb97x-d3
keywords: def2-TZVPP
keywords: def2/J RIJCOSX
keywords: DEFGRID2
keywords: scfconv7
keywords: smallprint printgap noloewdin
keywords: NOSOSCF
formula: C13H23N2O3PS
InChI: InChI=1/C13H23N2O3PS/c1-7-16-19(20,17-10(2)3)18-11-8-14-12(15-9-11)13(4,5)6/h8-10H,7H2,1-6H3
43 atoms
S  3.461762 -0.840071 1.655265
P  1.900892 -0.341902 0.666016
O  1.701741 1.181421 0.263221
O  0.553906 -0.577481 1.543262
O  1.626563 -1.101467 -0.706764
N  -2.589072 -1.175702 -0.13679
N  -2.520499 1.063711 0.573155
C  -4.502741 0.240612 -0.615219
C  -4.46299 -0.126127 -2.102953
C  -4.979792 1.683043 -0.473828
C  -5.484936 -0.683502 0.113971
C  -3.120558 0.041717 -0.023779
C  2.629042 1.865248 -0.632072
C  -0.687931 -0.358357 0.989568
C  -1.381503 -1.376135 0.360142
C  -1.310298 0.868386 1.079434
C  1.790067 2.655369 -1.608337
C  3.552961 2.726946 0.196651
C  2.288684 -2.324835 -1.099247
C  3.486304 -2.027615 -1.963482
H  -5.4459 0.031365 -2.550887
H  -4.191271 -1.169581 -2.258065
H  -3.747917 0.494465 -2.64678
H  -5.057366 1.992913 0.56828
H  -4.322301 2.385984 -0.985763
H  -5.9718 1.7785 -0.918558
H  -6.490397 -0.550444 -0.289572
H  -5.523751 -0.459615 1.181836
H  -5.216655 -1.733445 -0.001568
H  3.215309 1.121028 -1.179629
H  -0.95504 -2.369515 0.266881
H  -0.833658 1.706625 1.575242
H  1.172325 3.392073 -1.092637
H  2.441453 3.188476 -2.300636
H  1.14145 2.004137 -2.194174
H  2.994283 3.47016 0.767075
H  4.244327 3.255248 -0.460012
H  4.143527 2.126156 0.888127
H  2.571676 -2.898607 -0.215963
H  1.538517 -2.895857 -1.643896
H  4.248022 -1.47315 -1.415336
H  3.929714 -2.96715 -2.294738
H  3.208076 -1.459149 -2.851063
elementType: S P O N C H
totalener: -1584.18539085 hartree
nucrepener: 2013.78287892 hartree
electener: -3597.96826977 hartree
oneelecener: -6176.38219232 hartree
twoeener: 2578.41392255 hartree
cpcmener: -0.02389048 hartree
kineticenergy: 1578.91754579 hartree
xcener: -118.037398588855 hartree
chargesum: -0.0000000
charge: -0.429368 0.725319 -0.341934 -0.360031 -0.345471 -0.396635 -0.350746 0.294966 -0.339230 -0.324642 -0.338891 0.251499 0.147567 0.218448 0.000377 0.002494 -0.256871 -0.247419 0.062001 -0.248775 0.097312 0.094547 0.105125 0.091540 0.094262 0.099363 0.097868 0.104707 0.094863 0.076652 0.144229 0.140401 0.092590 0.100127 0.096786 0.092868 0.097355 0.082946 0.091087 0.108815 0.076864 0.103814 0.093218
qa: -0.4294 0.7253 -0.3419 -0.3600 -0.3455 -0.3966 -0.3507 0.2950 -0.3392 -0.3246 -0.3389 0.2515 0.1476 0.2184 0.0004 0.0025 -0.2569 -0.2474 0.0620 -0.2488 0.0973 0.0945 0.1051 0.0915 0.0943 0.0994 0.0979 0.1047 0.0949 0.0767 0.1442 0.1404 0.0926 0.1001 0.0968 0.0929 0.0974 0.0829 0.0911 0.1088 0.0769 0.1038 0.0932
va: 2.0147 5.5256 2.0871 2.1150 2.0569 3.0515 3.0710 3.6186 3.9321 3.9283 3.9330 3.9552 3.8494 3.7424 4.1152 4.0859 3.9269 3.9294 3.8077 3.9224 1.0029 1.0180 1.0022 1.0127 1.0112 1.0027 1.0027 1.0024 1.0168 0.9983 1.0045 1.0130 1.0060 1.0071 1.0101 1.0059 1.0071 1.0230 1.0142 0.9938 1.0156 1.0100 1.0025
dispcorr: -0.021343342 hartree
energy: -1584.206734191621
dipole: -13.94741 14.36339 0.41598 8.72204 -8.63229 0.08975 -19.94247 18.03111 -1.91136
magnitude: 1.95816 au
magnitude: 4.97724 debye
