program: Orca
programVersion: 5.0.2
elementType: S P O O O N N C C C C C C C C C C C C C H H H H H H H H H H H H H H H H H H H H H H H
charge: 0
multiplicity: 1
keywords: wb97x-d3
keywords: def2-TZVPP
keywords: def2/J RIJCOSX
keywords: DEFGRID2
keywords: scfconv7
keywords: smallprint printgap noloewdin
keywords: NOSOSCF
formula: C13H23N2O3PS
InChI: InChI=1/C13H23N2O3PS/c1-7-16-19(20,17-10(2)3)18-11-8-14-12(15-9-11)13(4,5)6/h8-10H,7H2,1-6H3
43 atoms
S  3.464712 -0.992031 1.58705
P  1.911924 -0.412953 0.628672
O  1.710982 1.134832 0.340287
O  0.56306 -0.714346 1.483086
O  1.649741 -1.060598 -0.802954
N  -2.510179 1.000995 0.65482
N  -2.591855 -1.177977 -0.222458
C  -4.503032 0.325414 -0.554014
C  -4.390892 1.480518 -1.555794
C  -5.412959 0.743639 0.606436
C  -5.115579 -0.881825 -1.257236
C  -3.120567 0.020625 -0.01125
C  2.611474 1.882376 -0.530717
C  -0.679122 -0.451818 0.949481
C  -1.300794 0.770491 1.133353
C  -1.375243 -1.414727 0.250803
C  1.743967 2.715135 -1.444841
C  3.540544 2.707092 0.329197
C  2.289201 -2.271733 -1.264319
C  3.500153 -1.944986 -2.098641
H  -3.73583 1.222533 -2.390176
H  -4.004439 2.386742 -1.090087
H  -5.374966 1.712278 -1.967294
H  -5.049765 1.642248 1.104042
H  -6.417295 0.952768 0.233645
H  -5.49436 -0.047873 1.35413
H  -5.230062 -1.734267 -0.587287
H  -4.523558 -1.204848 -2.113484
H  -6.108266 -0.617602 -1.625626
H  3.196733 1.179341 -1.130715
H  -0.817565 1.568841 1.685815
H  -0.951564 -2.398343 0.078084
H  1.09057 2.089371 -2.052725
H  1.128752 3.415238 -0.877598
H  2.375034 3.293143 -2.119694
H  4.149918 2.075274 0.975224
H  2.985091 3.411329 0.950022
H  4.214445 3.278903 -0.308898
H  2.553443 -2.903976 -0.415766
H  1.532976 -2.793721 -1.848371
H  3.932254 -2.870523 -2.480066
H  3.240103 -1.320679 -2.953512
H  4.26434 -1.435946 -1.511149
elementType: S P O N C H
totalener: -1584.18563051 hartree
nucrepener: 2013.62581354 hartree
electener: -3597.81144406 hartree
oneelecener: -6176.04489910 hartree
twoeener: 2578.23345504 hartree
cpcmener: -0.02391757 hartree
kineticenergy: 1578.91739654 hartree
xcener: -118.037242773391 hartree
chargesum: 0.0000000
charge: -0.429637 0.723562 -0.341945 -0.358573 -0.345361 -0.394390 -0.352915 0.294188 -0.340172 -0.338109 -0.326024 0.252495 0.148071 0.218451 -0.003458 0.005974 -0.258089 -0.246018 0.061526 -0.247842 0.105254 0.095247 0.097752 0.095058 0.097200 0.104204 0.094276 0.092686 0.099253 0.077008 0.142049 0.143282 0.096609 0.092543 0.100764 0.082263 0.092925 0.097120 0.090442 0.108915 0.103249 0.092894 0.077274
qa: -0.4296 0.7236 -0.3419 -0.3586 -0.3454 -0.3944 -0.3529 0.2942 -0.3402 -0.3381 -0.3260 0.2525 0.1481 0.2185 -0.0035 0.0060 -0.2581 -0.2460 0.0615 -0.2478 0.1053 0.0952 0.0978 0.0951 0.0972 0.1042 0.0943 0.0927 0.0993 0.0770 0.1420 0.1433 0.0966 0.0925 0.1008 0.0823 0.0929 0.0971 0.0904 0.1089 0.1032 0.0929 0.0773
va: 2.0156 5.5284 2.0884 2.1144 2.0565 3.0458 3.0772 3.6213 3.9335 3.9302 3.9272 3.9551 3.8495 3.7440 4.1014 4.0987 3.9255 3.9311 3.8088 3.9227 1.0025 1.0167 1.0028 1.0180 1.0030 1.0024 1.0111 1.0122 1.0028 0.9987 1.0120 1.0052 1.0103 1.0059 1.0072 1.0224 1.0058 1.0070 1.0142 0.9939 1.0101 1.0026 1.0158
dispcorr: -0.021375143 hartree
energy: -1584.207005654427
dipole: -14.13165 14.52568 0.39402 10.75183 -10.44906 0.30277 -19.02572 17.13021 -1.89551
magnitude: 1.95956 au
magnitude: 4.98080 debye
