program: Orca
programVersion: 5.0.2
elementType: S P O O O N N C C C C C C C C C C C C C H H H H H H H H H H H H H H H H H H H H H H H
charge: 0
multiplicity: 1
keywords: wb97x-d3
keywords: def2-TZVPP
keywords: def2/J RIJCOSX
keywords: DEFGRID2
keywords: scfconv7
keywords: smallprint printgap noloewdin
keywords: NOSOSCF
formula: C13H23N2O3PS
InChI: InChI=1/C13H23N2O3PS/c1-7-16-19(20,17-10(2)3)18-11-8-14-12(15-9-11)13(4,5)6/h8-10H,7H2,1-6H3
43 atoms
S  1.604977 -0.407386 2.412413
P  1.921284 -0.606326 0.533323
O  2.03185 0.719495 -0.337087
O  0.745729 -1.391772 -0.282758
O  3.170914 -1.517765 0.197961
N  -2.222147 0.484097 -1.149924
N  -2.689016 -0.89132 0.697629
C  -4.46712 0.521015 -0.159967
C  -4.755423 1.53418 -1.263845
C  -4.69807 1.188327 1.201144
C  -5.421422 -0.668103 -0.314828
C  -3.039073 0.014745 -0.215667
C  2.373954 2.029853 0.19479
C  -0.533242 -0.89613 -0.255116
C  -0.974349 0.034132 -1.173023
C  -1.447825 -1.341655 0.682921
C  3.870983 2.135573 0.376921
C  1.816957 3.038708 -0.781618
C  3.934874 -1.489735 -1.033486
C  3.165931 -1.974331 -2.237292
H  -5.79144 1.86758 -1.183275
H  -4.624126 1.108234 -2.258758
H  -4.120158 2.416955 -1.189813
H  -4.016226 2.027113 1.353487
H  -5.717107 1.575074 1.258096
H  -4.562171 0.4881 2.024938
H  -5.296902 -1.396766 0.485672
H  -5.267671 -1.181256 -1.266195
H  -6.455723 -0.320377 -0.290061
H  1.874899 2.138766 1.160827
H  -0.32037 0.414543 -1.949932
H  -1.169998 -2.083674 1.423387
H  4.396927 2.003277 -0.569636
H  4.120362 3.123172 0.76528
H  4.245314 1.400414 1.090871
H  2.018447 4.04494 -0.415071
H  0.736813 2.933896 -0.88936
H  2.278863 2.940288 -1.765007
H  4.324675 -0.483435 -1.190533
H  4.779521 -2.144771 -0.830921
H  3.864689 -2.072766 -3.068613
H  2.719089 -2.952865 -2.063418
H  2.387703 -1.278125 -2.547529
elementType: S P O N C H
totalener: -1584.18527482 hartree
nucrepener: 2023.75261223 hartree
electener: -3607.93788705 hartree
oneelecener: -6196.45084357 hartree
twoeener: 2588.51295652 hartree
cpcmener: -0.02499431 hartree
kineticenergy: 1578.91788912 hartree
xcener: -118.039080530628 hartree
chargesum: -0.0000000
charge: -0.436987 0.717897 -0.338162 -0.355352 -0.348286 -0.353897 -0.394504 0.297441 -0.324709 -0.340676 -0.338933 0.248493 0.155819 0.236664 0.002074 -0.010543 -0.260022 -0.260247 0.032138 -0.246411 0.099648 0.092847 0.092422 0.105465 0.097522 0.094908 0.094463 0.104485 0.097033 0.075371 0.143870 0.139201 0.093918 0.109022 0.094063 0.097889 0.099554 0.093129 0.104509 0.111484 0.102164 0.091661 0.083573
qa: -0.4370 0.7179 -0.3382 -0.3554 -0.3483 -0.3539 -0.3945 0.2974 -0.3247 -0.3407 -0.3389 0.2485 0.1558 0.2367 0.0021 -0.0105 -0.2600 -0.2602 0.0321 -0.2464 0.0996 0.0928 0.0924 0.1055 0.0975 0.0949 0.0945 0.1045 0.0970 0.0754 0.1439 0.1392 0.0939 0.1090 0.0941 0.0979 0.0996 0.0931 0.1045 0.1115 0.1022 0.0917 0.0836
va: 2.0198 5.5158 2.0587 2.0731 2.1132 3.0646 3.0512 3.6173 3.9295 3.9330 3.9331 3.9612 3.8118 3.6957 4.0865 4.1419 3.8975 3.9316 3.8643 3.9070 1.0024 1.0118 1.0119 1.0021 1.0030 1.0171 1.0180 1.0023 1.0030 1.0243 1.0068 1.0136 1.0039 1.0095 1.0170 1.0067 1.0049 1.0064 0.9903 0.9896 1.0084 1.0057 1.0110
dispcorr: -0.022003422 hartree
energy: -1584.207278240838
dipole: -11.05981 12.62621 1.56640 14.72874 -13.78729 0.94145 -12.31697 10.37619 -1.94077
magnitude: 2.66581 au
magnitude: 6.77595 debye
