program: Orca
programVersion: 5.0.2
elementType: S P O O O N N C C C C C C C C C C C C C H H H H H H H H H H H H H H H H H H H H H H H
charge: 0
multiplicity: 1
keywords: wb97x-d3
keywords: def2-TZVPP
keywords: def2/J RIJCOSX
keywords: DEFGRID2
keywords: scfconv7
keywords: smallprint printgap noloewdin
keywords: NOSOSCF
formula: C13H23N2O3PS
InChI: InChI=1/C13H23N2O3PS/c1-7-16-19(20,17-10(2)3)18-11-8-14-12(15-9-11)13(4,5)6/h8-10H,7H2,1-6H3
43 atoms
S  1.970605 -0.301931 2.377845
P  1.990745 0.268418 0.546064
O  3.22786 1.181418 0.189994
O  0.760831 1.238662 0.089147
O  1.929574 -0.8874 -0.550199
N  -2.282326 -0.172842 -1.236951
N  -2.557532 0.187452 1.069672
C  -4.395263 -0.802366 -0.219421
C  -5.162547 -0.68311 1.094178
C  -4.269383 -2.285554 -0.590756
C  -5.171901 -0.06689 -1.316678
C  -2.998655 -0.221445 -0.113343
C  3.383041 2.096055 -0.939399
C  -0.513735 0.734494 0.029644
C  -1.048451 0.292692 -1.167613
C  -1.321609 0.664025 1.145349
C  4.631567 2.893881 -0.641145
C  3.46994 1.344825 -2.249751
C  1.837123 -2.297548 -0.247258
C  0.404463 -2.756256 -0.156552
H  -5.28274 0.354761 1.406792
H  -4.679302 -1.224793 1.906963
H  -6.16106 -1.104836 0.966799
H  -5.26026 -2.738297 -0.658841
H  -3.775102 -2.421168 -1.552806
H  -3.702546 -2.8378 0.161457
H  -6.185654 -0.46575 -1.383172
H  -4.70604 -0.182194 -2.294394
H  -5.250236 1.000814 -1.102333
H  2.521358 2.765917 -0.950138
H  -0.468687 0.328934 -2.08405
H  -0.974499 1.006846 2.113359
H  5.516721 2.256729 -0.618722
H  4.775307 3.642501 -1.419649
H  4.552585 3.417218 0.311724
H  4.264909 0.598382 -2.227705
H  3.698787 2.053287 -3.046117
H  2.532584 0.856006 -2.513154
H  2.357349 -2.796687 -1.06288
H  2.376967 -2.509297 0.676132
H  -0.130369 -2.263927 0.656637
H  -0.134576 -2.582605 -1.087551
H  0.39181 -3.829078 0.039487
elementType: S P O N C H
totalener: -1584.18415379 hartree
nucrepener: 2031.09643192 hartree
electener: -3615.28058571 hartree
oneelecener: -6210.94109908 hartree
twoeener: 2595.66051337 hartree
cpcmener: -0.02373368 hartree
kineticenergy: 1578.89954745 hartree
xcener: -118.037915125609 hartree
chargesum: 0.0000000
charge: -0.439351 0.709644 -0.347951 -0.352432 -0.334820 -0.386110 -0.347176 0.298209 -0.323716 -0.343750 -0.337287 0.245462 0.140104 0.248805 -0.027041 -0.000674 -0.242922 -0.261000 0.058806 -0.254581 0.095526 0.090802 0.098931 0.099893 0.096169 0.104643 0.097177 0.093650 0.103789 0.085407 0.147684 0.132237 0.090257 0.090725 0.097914 0.095959 0.101412 0.092269 0.107997 0.091811 0.078536 0.092552 0.112441
qa: -0.4394 0.7096 -0.3480 -0.3524 -0.3348 -0.3861 -0.3472 0.2982 -0.3237 -0.3437 -0.3373 0.2455 0.1401 0.2488 -0.0270 -0.0007 -0.2429 -0.2610 0.0588 -0.2546 0.0955 0.0908 0.0989 0.0999 0.0962 0.1046 0.0972 0.0936 0.1038 0.0854 0.1477 0.1322 0.0903 0.0907 0.0979 0.0960 0.1014 0.0923 0.1080 0.0918 0.0785 0.0926 0.1124
va: 2.0056 5.5308 2.1621 2.0587 2.0692 3.0409 3.0729 3.6213 3.9269 3.9323 3.9281 3.9617 3.8465 3.6890 4.0928 4.1144 3.9196 3.9092 3.8240 3.9165 1.0104 1.0133 1.0028 1.0034 1.0147 1.0025 1.0032 1.0195 1.0027 1.0069 1.0055 1.0161 1.0067 1.0060 1.0084 1.0079 1.0075 1.0137 0.9928 1.0176 1.0077 1.0046 1.0103
dispcorr: -0.022744895 hartree
energy: -1584.206898684735
dipole: -14.90377 15.44563 0.54187 -6.70316 6.73233 0.02918 -13.99756 11.85768 -2.13988
magnitude: 2.20761 au
magnitude: 5.61130 debye
