program: Orca
programVersion: 5.0.2
elementType: S P O O O N N C C C C C C C C C C C C C H H H H H H H H H H H H H H H H H H H H H H H
charge: 0
multiplicity: 1
keywords: wb97x-d3
keywords: def2-TZVPP
keywords: def2/J RIJCOSX
keywords: DEFGRID2
keywords: scfconv7
keywords: smallprint printgap noloewdin
keywords: NOSOSCF
formula: C13H23N2O3PS
InChI: InChI=1/C13H23N2O3PS/c1-7-16-19(20,17-10(2)3)18-11-8-14-12(15-9-11)13(4,5)6/h8-10H,7H2,1-6H3
43 atoms
S  1.56663 -1.037213 2.093189
P  1.786808 -0.024333 0.481591
O  3.065648 0.901899 0.502188
O  0.620854 1.062719 0.159458
O  1.773376 -0.861207 -0.877431
N  -2.528458 0.01981 -1.267906
N  -2.777555 0.249687 1.058099
C  -4.709889 -0.433729 -0.240528
C  -5.150198 -0.669786 -1.682188
C  -5.573483 0.676351 0.368446
C  -4.902417 -1.726729 0.561107
C  -3.251201 -0.030816 -0.155962
C  3.391818 2.003444 -0.402245
C  -0.687469 0.665946 0.053644
C  -1.250906 0.362567 -1.167118
C  -1.507305 0.594848 1.165895
C  4.367613 2.874977 0.354105
C  3.964716 1.479753 -1.70053
C  2.25768 -2.218199 -0.960756
C  3.761164 -2.303732 -0.875258
H  -5.049987 0.226925 -2.294341
H  -6.201964 -0.960922 -1.694712
H  -4.582784 -1.467518 -2.16195
H  -5.439711 1.621733 -0.160863
H  -6.628437 0.405098 0.300425
H  -5.340902 0.842188 1.419758
H  -4.288421 -2.537312 0.163533
H  -5.945092 -2.045311 0.511383
H  -4.6453 -1.593559 1.61187
H  2.47991 2.56959 -0.599557
H  -0.669819 0.407254 -2.081759
H  -1.130522 0.833738 2.15421
H  4.620884 3.744338 -0.252169
H  3.940167 3.234978 1.289997
H  5.292022 2.338623 0.57414
H  4.841446 0.855375 -1.522974
H  4.275041 2.32464 -2.315725
H  3.237041 0.909484 -2.275733
H  1.78434 -2.814151 -0.178352
H  1.900133 -2.580979 -1.922505
H  4.243991 -1.697404 -1.641252
H  4.13541 -1.997729 0.102384
H  4.062442 -3.33999 -1.030742
elementType: S P O N C H
totalener: -1584.18478595 hartree
nucrepener: 2001.33780673 hartree
electener: -3585.52259268 hartree
oneelecener: -6151.72135165 hartree
twoeener: 2566.19875897 hartree
cpcmener: -0.02369738 hartree
kineticenergy: 1578.91577372 hartree
xcener: -118.039395547608 hartree
chargesum: 0.0000000
charge: -0.435501 0.716892 -0.341087 -0.355924 -0.343479 -0.352450 -0.394436 0.296998 -0.322694 -0.337563 -0.340554 0.251891 0.156966 0.221840 0.005792 -0.005039 -0.246475 -0.289915 0.043402 -0.250947 0.093616 0.098773 0.091601 0.104070 0.096966 0.093752 0.105366 0.097547 0.095246 0.089254 0.141907 0.138370 0.091632 0.097967 0.089974 0.092772 0.110244 0.100635 0.097687 0.109325 0.093320 0.084902 0.107356
qa: -0.4355 0.7169 -0.3411 -0.3559 -0.3435 -0.3524 -0.3944 0.2970 -0.3227 -0.3376 -0.3406 0.2519 0.1570 0.2218 0.0058 -0.0050 -0.2465 -0.2899 0.0434 -0.2509 0.0936 0.0988 0.0916 0.1041 0.0970 0.0938 0.1054 0.0975 0.0952 0.0893 0.1419 0.1384 0.0916 0.0980 0.0900 0.0928 0.1102 0.1006 0.0977 0.1093 0.0933 0.0849 0.1074
va: 2.0179 5.5317 2.1314 2.0907 2.0605 3.0762 3.0546 3.6220 3.9272 3.9314 3.9340 3.9525 3.8143 3.7171 4.1085 4.1292 3.9268 3.9121 3.8269 3.9076 1.0115 1.0029 1.0127 1.0024 1.0030 1.0187 1.0022 1.0028 1.0166 1.0073 1.0093 1.0147 1.0058 1.0086 1.0068 1.0020 1.0103 1.0146 1.0141 0.9927 1.0020 1.0165 1.0104
dispcorr: -0.021163785 hartree
energy: -1584.205949736396
dipole: -6.50618 7.87133 1.36516 -0.73737 1.33675 0.59938 -12.23315 10.24517 -1.98798
magnitude: 2.48494 au
magnitude: 6.31623 debye
