program: Orca
programVersion: 5.0.2
elementType: S P O O O N N C C C C C C C C C C C C C H H H H H H H H H H H H H H H H H H H H H H H
charge: 0
multiplicity: 1
keywords: wb97x-d3
keywords: def2-TZVPP
keywords: def2/J RIJCOSX
keywords: DEFGRID2
keywords: scfconv7
keywords: smallprint printgap noloewdin
keywords: NOSOSCF
formula: C13H23N2O3PS
InChI: InChI=1/C13H23N2O3PS/c1-7-16-19(20,17-10(2)3)18-11-8-14-12(15-9-11)13(4,5)6/h8-10H,7H2,1-6H3
43 atoms
S  3.512423 -0.690618 1.585544
P  1.927051 -0.285024 0.595429
O  1.645485 1.224636 0.202575
O  0.594015 -0.634466 1.462907
O  1.70441 -1.022197 -0.797821
N  -2.544194 -1.218103 -0.241843
N  -2.538451 0.962908 0.633203
C  -4.504738 0.220627 -0.578373
C  -4.448873 1.41939 -1.532047
C  -5.436755 0.544597 0.59541
C  -5.054008 -0.987301 -1.331901
C  -3.112847 -0.036998 -0.036245
C  2.686911 2.168967 -0.176151
C  -0.658169 -0.42609 0.931632
C  -1.322348 -1.414596 0.23704
C  -1.323202 0.77374 1.113494
C  3.228221 1.844473 -1.55171
C  2.053156 3.538585 -0.102003
C  2.074436 -2.401774 -1.018329
C  3.393276 -2.48833 -1.744212
H  -3.780571 1.227901 -2.373772
H  -4.107867 2.323961 -1.029457
H  -5.442393 1.618853 -1.937128
H  -5.116239 1.436097 1.133565
H  -6.449202 0.722998 0.229188
H  -5.481967 -0.28246 1.306638
H  -6.053948 -0.756287 -1.70292
H  -5.13575 -1.86821 -0.694767
H  -4.438356 -1.251792 -2.192078
H  3.487084 2.093265 0.564863
H  -0.870411 -2.387072 0.070922
H  -0.867048 1.589102 1.664581
H  3.947112 2.610474 -1.841919
H  3.749518 0.886999 -1.57726
H  2.432556 1.830076 -2.29758
H  1.24331 3.642032 -0.825851
H  2.803185 4.296311 -0.325583
H  1.65935 3.742534 0.893836
H  2.109105 -2.944957 -0.072173
H  1.268219 -2.82765 -1.613909
H  3.364355 -1.945653 -2.689399
H  4.210307 -2.096737 -1.138852
H  3.610035 -3.533408 -1.966503
elementType: S P O N C H
totalener: -1584.18582739 hartree
nucrepener: 2013.66461399 hartree
electener: -3597.85044138 hartree
oneelecener: -6176.19781103 hartree
twoeener: 2578.34736965 hartree
cpcmener: -0.02384023 hartree
kineticenergy: 1578.91935560 hartree
xcener: -118.038218561187 hartree
chargesum: 0.0000000
charge: -0.429230 0.722564 -0.329237 -0.362743 -0.342412 -0.353064 -0.396656 0.296924 -0.340248 -0.340176 -0.326134 0.251830 0.131602 0.217605 0.005478 -0.000322 -0.240167 -0.256322 0.049776 -0.251037 0.104764 0.095250 0.097387 0.095657 0.097378 0.104824 0.099477 0.093062 0.093469 0.074374 0.146787 0.140459 0.100829 0.082766 0.095344 0.092223 0.096598 0.099208 0.098279 0.109033 0.091613 0.079872 0.103320
qa: -0.4292 0.7226 -0.3292 -0.3627 -0.3424 -0.3531 -0.3967 0.2969 -0.3402 -0.3402 -0.3261 0.2518 0.1316 0.2176 0.0055 -0.0003 -0.2402 -0.2563 0.0498 -0.2510 0.1048 0.0952 0.0974 0.0957 0.0974 0.1048 0.0995 0.0931 0.0935 0.0744 0.1468 0.1405 0.1008 0.0828 0.0953 0.0922 0.0966 0.0992 0.0983 0.1090 0.0916 0.0799 0.1033
va: 2.0141 5.5235 2.1149 2.1105 2.0561 3.0795 3.0505 3.6156 3.9330 3.9317 3.9273 3.9553 3.8500 3.7457 4.0993 4.1088 3.8816 3.9220 3.8167 3.9401 1.0023 1.0176 1.0030 1.0173 1.0029 1.0021 1.0028 1.0117 1.0115 1.0184 1.0012 1.0105 1.0093 1.0154 1.0085 1.0060 1.0063 1.0080 1.0038 0.9925 1.0021 1.0159 1.0096
dispcorr: -0.021419043 hartree
energy: -1584.207246431447
dipole: -14.86073 15.15226 0.29154 7.90196 -7.70776 0.19420 -18.34075 16.92809 -1.41266
magnitude: 1.45544 au
magnitude: 3.69944 debye
