program: Orca
programVersion: 5.0.2
elementType: S P O O O N N C C C C C C C C C C C C C H H H H H H H H H H H H H H H H H H H H H H H
charge: 0
multiplicity: 1
keywords: wb97x-d3
keywords: def2-TZVPP
keywords: def2/J RIJCOSX
keywords: DEFGRID2
keywords: scfconv7
keywords: smallprint printgap noloewdin
keywords: NOSOSCF
formula: C13H23N2O3PS
InChI: InChI=1/C13H23N2O3PS/c1-7-16-19(20,17-10(2)3)18-11-8-14-12(15-9-11)13(4,5)6/h8-10H,7H2,1-6H3
43 atoms
S  1.81437 0.315262 2.450444
P  1.940413 -0.434059 0.692025
O  1.885737 0.595283 -0.518655
O  0.745878 -1.447602 0.243735
O  3.20494 -1.370462 0.519626
N  -2.253962 -0.032969 -1.187798
N  -2.652633 -0.535861 1.072724
C  -4.447747 0.460095 -0.27247
C  -5.211895 0.461789 1.048447
C  -5.187714 -0.432683 -1.276067
C  -4.387825 1.892553 -0.814923
C  -3.034661 -0.064723 -0.107455
C  2.288562 1.987827 -0.444844
C  -0.536217 -0.969471 0.127129
C  -1.01536 -0.477759 -1.074846
C  -1.410062 -0.985331 1.193693
C  3.795092 2.09276 -0.526187
C  1.580313 2.689017 -1.580941
C  3.428817 -2.330488 -0.543224
C  3.657211 -1.697735 -1.892928
H  -5.321919 -0.539753 1.463991
H  -6.214351 0.860323 0.883244
H  -4.73031 1.086548 1.801162
H  -5.236094 -1.467071 -0.930191
H  -6.212076 -0.078117 -1.404851
H  -4.708985 -0.425472 -2.255224
H  -5.398207 2.289202 -0.928393
H  -3.902436 1.937941 -1.7890
H  -3.846139 2.553439 -0.135326
H  1.939059 2.387365 0.510464
H  -0.38982 -0.455126 -1.960492
H  -1.109527 -1.375268 2.159676
H  4.088534 3.142244 -0.500094
H  4.282566 1.596429 0.314082
H  4.172551 1.659697 -1.453641
H  1.799566 3.755652 -1.542765
H  0.498641 2.567424 -1.51059
H  1.910771 2.311887 -2.549947
H  4.315416 -2.87349 -0.222364
H  2.600061 -3.038094 -0.571961
H  2.75439 -1.250883 -2.305875
H  4.441246 -0.941558 -1.854097
H  3.982101 -2.477399 -2.582567
elementType: S P O N C H
totalener: -1584.18499189 hartree
nucrepener: 2025.63084092 hartree
electener: -3609.81583281 hartree
oneelecener: -6200.14230351 hartree
twoeener: 2590.32647070 hartree
cpcmener: -0.02387334 hartree
kineticenergy: 1578.91113483 hartree
xcener: -118.038650612496 hartree
chargesum: -0.0000000
charge: -0.436528 0.713145 -0.330055 -0.357309 -0.346509 -0.397445 -0.352129 0.294971 -0.324830 -0.339682 -0.339092 0.254835 0.151518 0.241681 -0.014219 -0.004117 -0.257659 -0.262193 0.049457 -0.270323 0.091857 0.099011 0.095157 0.104957 0.097729 0.095268 0.097107 0.094421 0.104508 0.076656 0.145765 0.138722 0.107339 0.092146 0.092404 0.099578 0.098569 0.093633 0.110603 0.102191 0.088932 0.092794 0.107138
qa: -0.4365 0.7131 -0.3301 -0.3573 -0.3465 -0.3974 -0.3521 0.2950 -0.3248 -0.3397 -0.3391 0.2548 0.1515 0.2417 -0.0142 -0.0041 -0.2577 -0.2622 0.0495 -0.2703 0.0919 0.0990 0.0952 0.1050 0.0977 0.0953 0.0971 0.0944 0.1045 0.0767 0.1458 0.1387 0.1073 0.0921 0.0924 0.0996 0.0986 0.0936 0.1106 0.1022 0.0889 0.0928 0.1071
va: 2.0200 5.5264 2.0660 2.0779 2.1203 3.0365 3.0795 3.6240 3.9265 3.9349 3.9301 3.9519 3.8118 3.6978 4.0985 4.1212 3.9029 3.9343 3.8404 3.9307 1.0128 1.0029 1.0108 1.0024 1.0027 1.0161 1.0033 1.0190 1.0023 1.0261 1.0063 1.0139 1.0102 1.0177 1.0034 1.0067 1.0062 1.0049 0.9872 0.9992 1.0073 1.0007 1.0104
dispcorr: -0.022139182 hartree
energy: -1584.207131073528
dipole: -11.80953 12.88931 1.07978 11.13560 -11.23051 -0.09491 -17.67695 15.45234 -2.22461
magnitude: 2.47464 au
magnitude: 6.29003 debye
