program: Orca
programVersion: 5.0.2
elementType: S P O O O N N C C C C C C C C C C C C C H H H H H H H H H H H H H H H H H H H H H H H
charge: 0
multiplicity: 1
keywords: wb97x-d3
keywords: def2-TZVPP
keywords: def2/J RIJCOSX
keywords: DEFGRID2
keywords: scfconv7
keywords: smallprint printgap noloewdin
keywords: NOSOSCF
formula: C13H23N2O3PS
InChI: InChI=1/C13H23N2O3PS/c1-7-16-19(20,17-10(2)3)18-11-8-14-12(15-9-11)13(4,5)6/h8-10H,7H2,1-6H3
43 atoms
S  1.596564 0.281912 1.864606
P  2.100422 -0.171472 0.068817
O  2.934104 0.901628 -0.748399
O  0.845996 -0.525249 -0.916747
O  3.047648 -1.414896 -0.199071
N  -2.388393 -0.997952 0.625837
N  -2.558226 0.631352 -1.057618
C  -4.555904 0.022464 0.228758
C  -5.211868 -1.361918 0.231875
C  -5.276008 0.90962 -0.782569
C  -4.679844 0.650009 1.62307
C  -3.082162 -0.119328 -0.097569
C  2.87468 2.332582 -0.484161
C  -0.473724 -0.375177 -0.600072
C  -1.098329 -1.131435 0.377749
C  -1.260797 0.509481 -1.306072
C  4.096842 2.936083 -1.135986
C  1.580847 2.91439 -1.011269
C  2.663425 -2.779046 0.081099
C  3.01585 -3.186429 1.489551
H  -4.775853 -2.018072 0.9840
H  -5.114766 -1.8509 -0.739615
H  -6.277074 -1.267487 0.449986
H  -6.333497 0.969078 -0.519799
H  -4.883268 1.925812 -0.79561
H  -5.210822 0.511389 -1.795805
H  -5.732078 0.772104 1.886387
H  -4.212183 1.635755 1.658513
H  -4.215182 0.027934 2.388501
H  2.929311 2.4755 0.597977
H  -0.549808 -1.866299 0.957016
H  -0.84077 1.120579 -2.097832
H  4.075009 2.814044 -2.219756
H  4.126495 4.003776 -0.919743
H  5.015596 2.493797 -0.751053
H  0.709388 2.516455 -0.489396
H  1.466791 2.7271 -2.079711
H  1.582042 3.993622 -0.857247
H  1.599177 -2.922312 -0.116615
H  3.214042 -3.375527 -0.644199
H  2.83447 -4.255944 1.60017
H  4.067954 -3.002601 1.70672
H  2.409405 -2.665187 2.228946
elementType: S P O N C H
totalener: -1584.18398058 hartree
nucrepener: 2010.13658256 hartree
electener: -3594.32056314 hartree
oneelecener: -6169.17465607 hartree
twoeener: 2574.85409293 hartree
cpcmener: -0.02474818 hartree
kineticenergy: 1578.91657579 hartree
xcener: -118.042365748476 hartree
chargesum: -0.0000000
charge: -0.442970 0.744510 -0.346290 -0.361074 -0.343320 -0.396789 -0.355551 0.292079 -0.335975 -0.322988 -0.340679 0.249875 0.152867 0.255447 0.005793 -0.011232 -0.250340 -0.260804 0.029153 -0.247870 0.093421 0.103221 0.096897 0.098872 0.089762 0.095346 0.098093 0.105229 0.095931 0.075318 0.130833 0.149065 0.090778 0.091528 0.098130 0.083257 0.097462 0.106695 0.104316 0.113824 0.098178 0.091306 0.078699
qa: -0.4430 0.7445 -0.3463 -0.3611 -0.3433 -0.3968 -0.3556 0.2921 -0.3360 -0.3230 -0.3407 0.2499 0.1529 0.2554 0.0058 -0.0112 -0.2503 -0.2608 0.0292 -0.2479 0.0934 0.1032 0.0969 0.0989 0.0898 0.0953 0.0981 0.1052 0.0959 0.0753 0.1308 0.1491 0.0908 0.0915 0.0981 0.0833 0.0975 0.1067 0.1043 0.1138 0.0982 0.0913 0.0787
va: 1.9735 5.5153 2.1284 2.0641 2.1221 3.0699 3.0728 3.6245 3.9279 3.9272 3.9341 3.9546 3.8199 3.6752 4.1057 4.0957 3.9335 3.8822 3.8689 3.9144 1.0205 1.0030 1.0031 1.0028 1.0142 1.0105 1.0027 1.0029 1.0145 1.0209 1.0108 0.9998 1.0065 1.0048 1.0083 1.0173 1.0073 1.0095 0.9934 0.9911 1.0089 1.0046 1.0174
dispcorr: -0.021330327 hartree
energy: -1584.205310902626
dipole: -15.41456 16.05605 0.64149 4.42361 -4.60912 -0.18551 -0.37976 -0.39949 -0.77925
magnitude: 1.02623 au
magnitude: 2.60848 debye
