program: Orca
programVersion: 5.0.2
elementType: S P O O O N N C C C C C C C C C C C C C H H H H H H H H H H H H H H H H H H H H H H H
charge: 0
multiplicity: 1
keywords: wb97x-d3
keywords: def2-TZVPP
keywords: def2/J RIJCOSX
keywords: DEFGRID2
keywords: scfconv7
keywords: smallprint printgap noloewdin
keywords: NOSOSCF
formula: C13H23N2O3PS
InChI: InChI=1/C13H23N2O3PS/c1-7-16-19(20,17-10(2)3)18-11-8-14-12(15-9-11)13(4,5)6/h8-10H,7H2,1-6H3
43 atoms
S  1.481217 -0.060668 1.93701
P  2.085187 -0.101064 0.115798
O  3.151593 0.958672 -0.383987
O  0.90213 0.123905 -0.992181
O  2.836234 -1.412537 -0.371938
N  -2.498693 -1.069304 -0.97997
N  -2.385836 0.911611 0.27868
C  -4.52472 -0.222737 0.114812
C  -5.231376 1.057225 -0.344544
C  -4.6582 -0.364461 1.63598
C  -5.187653 -1.421732 -0.556266
C  -3.050173 -0.129309 -0.224551
C  2.911371 2.39373 -0.270112
C  -0.434043 0.039799 -0.713919
C  -1.196189 -0.989597 -1.222257
C  -1.09151 1.000654 0.03581
C  3.661011 2.918527 0.933101
C  3.363449 3.017494 -1.569766
C  2.637084 -2.707193 0.235017
C  1.308231 -3.319276 -0.128986
H  -6.294025 1.002013 -0.101891
H  -5.144777 1.193564 -1.424317
H  -4.826567 1.944176 0.141405
H  -5.710873 -0.443686 1.913415
H  -4.15126 -1.261325 1.997457
H  -4.239672 0.494465 2.160191
H  -5.127163 -1.369511 -1.643637
H  -6.244829 -1.446108 -0.286473
H  -4.746204 -2.367146 -0.240967
H  1.839539 2.571796 -0.138793
H  -0.752772 -1.758749 -1.845209
H  -0.561799 1.859778 0.433346
H  4.733343 2.742606 0.838323
H  3.502367 3.993495 1.018846
H  3.310313 2.455305 1.854986
H  4.43032 2.859369 -1.734058
H  3.184988 4.092056 -1.53787
H  2.813975 2.61317 -2.41977
H  3.460434 -3.311843 -0.139757
H  2.748116 -2.618785 1.316817
H  0.471665 -2.775133 0.31136
H  1.16948 -3.364782 -1.208992
H  1.274075 -4.338816 0.255905
elementType: S P O N C H
totalener: -1584.18469293 hartree
nucrepener: 2016.92771300 hartree
electener: -3601.11240593 hartree
oneelecener: -6182.77233117 hartree
twoeener: 2581.65992525 hartree
cpcmener: -0.02457883 hartree
kineticenergy: 1578.91953002 hartree
xcener: -118.042042649580 hartree
chargesum: -0.0000000
charge: -0.443070 0.749918 -0.353840 -0.362107 -0.348670 -0.352520 -0.396994 0.297664 -0.338691 -0.340756 -0.325667 0.249160 0.145682 0.253115 -0.017262 0.010177 -0.249504 -0.248897 0.044718 -0.255238 0.096963 0.103881 0.094055 0.097245 0.104769 0.095489 0.093648 0.099049 0.091958 0.077511 0.149898 0.132902 0.092191 0.099107 0.083729 0.092912 0.094161 0.096096 0.112694 0.095662 0.077423 0.094469 0.106968
qa: -0.4431 0.7499 -0.3538 -0.3621 -0.3487 -0.3525 -0.3970 0.2977 -0.3387 -0.3408 -0.3257 0.2492 0.1457 0.2531 -0.0173 0.0102 -0.2495 -0.2489 0.0447 -0.2552 0.0970 0.1039 0.0941 0.0972 0.1048 0.0955 0.0936 0.0990 0.0920 0.0775 0.1499 0.1329 0.0922 0.0991 0.0837 0.0929 0.0942 0.0961 0.1127 0.0957 0.0774 0.0945 0.1070
va: 1.9751 5.5101 2.1188 2.0595 2.1128 3.0724 3.0637 3.6167 3.9319 3.9335 3.9284 3.9566 3.8599 3.6729 4.0938 4.0929 3.9199 3.9363 3.8408 3.8952 1.0029 1.0022 1.0188 1.0030 1.0025 1.0167 1.0114 1.0028 1.0123 0.9964 0.9984 1.0105 1.0068 1.0063 1.0229 1.0067 1.0058 1.0096 0.9927 1.0109 1.0136 1.0049 1.0097
dispcorr: -0.021517220 hartree
energy: -1584.206210148930
dipole: -15.83012 16.48601 0.65589 2.32237 -2.20507 0.11730 -0.80073 0.08558 -0.71515
magnitude: 0.97744 au
magnitude: 2.48446 debye
