program: Orca
programVersion: 5.0.2
elementType: S P O O O N N C C C C C C C C C C C C C H H H H H H H H H H H H H H H H H H H H H H H
charge: 0
multiplicity: 1
keywords: wb97x-d3
keywords: def2-TZVPP
keywords: def2/J RIJCOSX
keywords: DEFGRID2
keywords: scfconv7
keywords: smallprint printgap noloewdin
keywords: NOSOSCF
formula: C13H23N2O3PS
InChI: InChI=1/C13H23N2O3PS/c1-7-16-19(20,17-10(2)3)18-11-8-14-12(15-9-11)13(4,5)6/h8-10H,7H2,1-6H3
43 atoms
S  2.067114 0.060277 2.411363
P  2.001246 0.357418 0.52058
O  3.220397 1.196938 -0.030123
O  0.759323 1.282205 -0.003334
O  1.879485 -0.924937 -0.415376
N  -2.538041 0.27173 1.083219
N  -2.302549 -0.19367 -1.208762
C  -4.381744 -0.814354 -0.085992
C  -5.308647 -0.100834 0.898698
C  -4.226048 -2.282259 0.337559
C  -5.006214 -0.756781 -1.479624
C  -2.997675 -0.194937 -0.07481
C  3.414113 1.508095 -1.449213
C  -0.514396 0.774215 -0.015262
C  -1.307093 0.757077 1.116543
C  -1.066227 0.277572 -1.179421
C  3.315454 3.006533 -1.614983
C  4.758138 0.948355 -1.850925
C  1.772599 -2.286077 0.057041
C  0.334216 -2.697115 0.240058
H  -4.960201 -0.179606 1.9269
H  -6.303625 -0.546545 0.851955
H  -5.410754 0.958793 0.657064
H  -3.809782 -2.369075 1.342422
H  -5.199398 -2.776582 0.336754
H  -3.574289 -2.830104 -0.345418
H  -6.009535 -1.184457 -1.444583
H  -4.433952 -1.319328 -2.215305
H  -5.09874 0.269972 -1.837975
H  2.631254 1.02663 -2.039925
H  -0.9457 1.147147 2.061423
H  -0.502673 0.273947 -2.106464
H  3.471939 3.265315 -2.662295
H  2.33296 3.378795 -1.325127
H  4.073701 3.522366 -1.024463
H  4.93386 1.148775 -2.907737
H  4.799316 -0.13108 -1.704702
H  5.566444 1.409902 -1.281969
H  2.259435 -2.889312 -0.707123
H  2.335472 -2.397108 0.984458
H  0.30495 -3.745401 0.539363
H  -0.158103 -2.115219 1.020065
H  -0.233332 -2.59902 -0.684908
elementType: S P O N C H
totalener: -1584.18570751 hartree
nucrepener: 2030.82358676 hartree
electener: -3615.00929427 hartree
oneelecener: -6210.29795399 hartree
twoeener: 2595.28865972 hartree
cpcmener: -0.02437749 hartree
kineticenergy: 1578.91016536 hartree
xcener: -118.037620567859 hartree
chargesum: 0.0000000
charge: -0.431540 0.708621 -0.360000 -0.350248 -0.335978 -0.372859 -0.363167 0.277590 -0.321272 -0.343226 -0.320189 0.249552 0.154759 0.252451 -0.007366 -0.021923 -0.254617 -0.251918 0.057221 -0.250872 0.088203 0.097831 0.101577 0.101409 0.102420 0.101873 0.098693 0.087790 0.101395 0.078684 0.132299 0.144799 0.097448 0.094014 0.090717 0.096006 0.094741 0.091130 0.109105 0.093300 0.112191 0.078232 0.091120
qa: -0.4315 0.7086 -0.3600 -0.3502 -0.3360 -0.3729 -0.3632 0.2776 -0.3213 -0.3432 -0.3202 0.2496 0.1548 0.2525 -0.0074 -0.0219 -0.2546 -0.2519 0.0572 -0.2509 0.0882 0.0978 0.1016 0.1014 0.1024 0.1019 0.0987 0.0878 0.1014 0.0787 0.1323 0.1448 0.0974 0.0940 0.0907 0.0960 0.0947 0.0911 0.1091 0.0933 0.1122 0.0782 0.0911
va: 2.0145 5.5320 2.1226 2.0583 2.0625 3.0628 3.0532 3.6456 3.9157 3.9319 3.9168 3.9519 3.8340 3.6813 4.1265 4.0879 3.9257 3.9393 3.8282 3.9189 1.0221 1.0034 1.0063 1.0085 1.0029 1.0059 1.0033 1.0201 1.0074 1.0053 1.0158 1.0076 1.0058 1.0129 1.0069 1.0052 1.0097 1.0069 0.9924 1.0154 1.0105 1.0067 1.0064
dispcorr: -0.022889433 hartree
energy: -1584.208596942605
dipole: -15.21327 15.71120 0.49793 -8.95381 8.29774 -0.65608 -13.02018 10.84550 -2.17468
magnitude: 2.32542 au
magnitude: 5.91076 debye
