program: Orca
programVersion: 5.0.2
elementType: S P O O O N N C C C C C C C C C C C C C H H H H H H H H H H H H H H H H H H H H H H H
charge: 0
multiplicity: 1
keywords: wb97x-d3
keywords: def2-TZVPP
keywords: def2/J RIJCOSX
keywords: DEFGRID2
keywords: scfconv7
keywords: smallprint printgap noloewdin
keywords: NOSOSCF
formula: C13H23N2O3PS
InChI: InChI=1/C13H23N2O3PS/c1-7-16-19(20,17-10(2)3)18-11-8-14-12(15-9-11)13(4,5)6/h8-10H,7H2,1-6H3
43 atoms
S  1.875533 0.386054 2.380886
P  1.965478 -0.313074 0.601036
O  1.856441 0.730238 -0.595644
O  0.779271 -1.341643 0.16612
O  3.245199 -1.213922 0.359656
N  -2.620335 -0.512483 1.073167
N  -2.274123 0.030275 -1.187416
C  -4.466366 0.443168 -0.233388
C  -5.167883 -0.39654 -1.307631
C  -4.452547 1.914137 -0.664599
C  -5.239766 0.318875 1.075662
C  -3.035943 -0.040688 -0.095309
C  2.309338 2.108708 -0.52008
C  -0.513336 -0.884756 0.082826
C  -1.364979 -0.932492 1.165942
C  -1.023763 -0.385569 -1.102813
C  3.819427 2.162286 -0.584804
C  1.638018 2.830195 -1.665386
C  3.545059 -1.861233 -0.905107
C  3.262919 -3.339494 -0.824209
H  -4.683954 -0.300379 -2.279067
H  -6.20332 -0.069943 -1.418351
H  -5.181222 -1.45478 -1.039381
H  -3.949463 2.541221 0.074034
H  -3.952856 2.053769 -1.622705
H  -5.475655 2.27989 -0.76762
H  -5.310579 -0.714124 1.416678
H  -6.25703 0.685532 0.927837
H  -4.792369 0.907423 1.876956
H  1.961699 2.522101 0.43018
H  -1.035138 -1.323525 2.121953
H  -0.41368 -0.334447 -1.998003
H  4.191588 1.687215 -1.493715
H  4.146604 3.201916 -0.587267
H  4.282455 1.67825 0.276123
H  1.97511 2.448543 -2.630192
H  1.882877 3.890852 -1.619114
H  0.552765 2.735043 -1.612634
H  2.98897 -1.395583 -1.719573
H  4.602996 -1.672862 -1.079385
H  3.59003 -3.810742 -1.751209
H  3.808018 -3.806246 -0.004119
H  2.200959 -3.548435 -0.702497
elementType: S P O N C H
totalener: -1584.18658374 hartree
nucrepener: 2016.67602167 hartree
electener: -3600.86260541 hartree
oneelecener: -6182.24382600 hartree
twoeener: 2581.38122059 hartree
cpcmener: -0.02418214 hartree
kineticenergy: 1578.91839608 hartree
xcener: -118.037645538660 hartree
chargesum: -0.0000000
charge: -0.431444 0.712571 -0.334271 -0.353748 -0.348663 -0.351191 -0.396382 0.296009 -0.338817 -0.339878 -0.324998 0.254102 0.146657 0.238223 -0.005675 -0.010621 -0.249088 -0.259088 0.046283 -0.246068 0.094757 0.097066 0.104712 0.104993 0.095036 0.097181 0.092598 0.099050 0.093426 0.074355 0.139258 0.145619 0.094317 0.105144 0.089500 0.091943 0.098195 0.098689 0.101916 0.108828 0.096643 0.088070 0.084787
qa: -0.4314 0.7126 -0.3343 -0.3537 -0.3487 -0.3512 -0.3964 0.2960 -0.3388 -0.3399 -0.3250 0.2541 0.1467 0.2382 -0.0057 -0.0106 -0.2491 -0.2591 0.0463 -0.2461 0.0948 0.0971 0.1047 0.1050 0.0950 0.0972 0.0926 0.0990 0.0934 0.0744 0.1393 0.1456 0.0943 0.1051 0.0895 0.0919 0.0982 0.0987 0.1019 0.1088 0.0966 0.0881 0.0848
va: 2.0237 5.5335 2.0682 2.0812 2.1006 3.0816 3.0367 3.6233 3.9328 3.9320 3.9278 3.9519 3.8289 3.6941 4.1214 4.1014 3.8877 3.9317 3.8324 3.9478 1.0177 1.0031 1.0022 1.0020 1.0176 1.0030 1.0119 1.0027 1.0117 1.0240 1.0137 1.0080 1.0069 1.0089 1.0201 1.0062 1.0065 1.0063 1.0022 0.9932 1.0066 1.0039 1.0113
dispcorr: -0.021523155 hartree
energy: -1584.208106891806
dipole: -12.59155 13.70378 1.11223 8.04651 -7.93610 0.11041 -15.51284 13.20604 -2.30680
magnitude: 2.56331 au
magnitude: 6.51542 debye
