program: Orca
programVersion: 5.0.2
elementType: S P O O O N N C C C C C C C C C C C C C H H H H H H H H H H H H H H H H H H H H H H H
charge: 0
multiplicity: 1
keywords: wb97x-d3
keywords: def2-TZVPP
keywords: def2/J RIJCOSX
keywords: DEFGRID2
keywords: scfconv7
keywords: smallprint printgap noloewdin
keywords: NOSOSCF
formula: C13H23N2O3PS
InChI: InChI=1/C13H23N2O3PS/c1-7-16-19(20,17-10(2)3)18-11-8-14-12(15-9-11)13(4,5)6/h8-10H,7H2,1-6H3
43 atoms
S  3.64028 -0.600234 1.46424
P  2.02998 -0.259373 0.488088
O  1.6575 1.235606 0.116969
O  0.714738 -0.662987 1.353393
O  1.865645 -1.004985 -0.911642
N  -2.438976 0.964347 0.664717
N  -2.477421 -1.191857 -0.267552
C  -4.44441 0.255016 -0.505014
C  -5.046599 -0.962946 -1.199123
C  -4.396142 1.421465 -1.498879
C  -5.326356 0.637935 0.688886
C  -3.037532 -0.017289 -0.010658
C  2.527466 2.080504 -0.692573
C  -0.552259 -0.434527 0.864399
C  -1.209144 0.760826 1.100119
C  -1.240511 -1.40204 0.164715
C  1.643552 2.782605 -1.697032
C  3.260191 3.032448 0.224598
C  2.583553 -2.207827 -1.258792
C  1.993997 -3.436431 -0.614448
H  -5.117381 -1.822834 -0.532315
H  -4.472335 -1.264721 -2.075096
H  -6.05689 -0.723364 -1.534963
H  -4.016653 2.33301 -1.037624
H  -3.763436 1.187885 -2.357312
H  -5.399048 1.632081 -1.874356
H  -6.348841 0.819154 0.353241
H  -4.97277 1.543454 1.180572
H  -5.35785 -0.160806 1.432541
H  3.248597 1.450913 -1.221844
H  -0.735257 1.560289 1.658954
H  -0.797857 -2.369999 -0.041852
H  0.900155 3.407301 -1.199102
H  2.252218 3.42733 -2.330628
H  1.127089 2.071192 -2.341257
H  3.902953 3.686012 -0.365108
H  3.890353 2.496259 0.933872
H  2.561018 3.658609 0.780681
H  2.519731 -2.266419 -2.343807
H  3.634151 -2.088723 -0.988974
H  2.543523 -4.312313 -0.960248
H  2.073022 -3.405318 0.472634
H  0.947982 -3.572006 -0.887429
elementType: S P O N C H
totalener: -1584.18557492 hartree
nucrepener: 2020.00972112 hartree
electener: -3604.19529604 hartree
oneelecener: -6188.86540699 hartree
twoeener: 2584.67011094 hartree
cpcmener: -0.02358671 hartree
kineticenergy: 1578.92262540 hartree
xcener: -118.039304687973 hartree
chargesum: 0.0000000
charge: -0.430102 0.726060 -0.342053 -0.355988 -0.344919 -0.394084 -0.355339 0.292554 -0.326375 -0.339398 -0.338651 0.252986 0.141611 0.225535 -0.003721 -0.006027 -0.256618 -0.245443 0.052558 -0.259004 0.094463 0.092458 0.099455 0.095083 0.105095 0.097758 0.096995 0.094999 0.104528 0.078084 0.139666 0.157924 0.090791 0.098765 0.097223 0.097935 0.083249 0.091441 0.111312 0.095116 0.107798 0.085219 0.091062
qa: -0.4301 0.7261 -0.3421 -0.3560 -0.3449 -0.3941 -0.3553 0.2926 -0.3264 -0.3394 -0.3387 0.2530 0.1416 0.2255 -0.0037 -0.0060 -0.2566 -0.2454 0.0526 -0.2590 0.0945 0.0925 0.0995 0.0951 0.1051 0.0978 0.0970 0.0950 0.1045 0.0781 0.1397 0.1579 0.0908 0.0988 0.0972 0.0979 0.0832 0.0914 0.1113 0.0951 0.1078 0.0852 0.0911
va: 2.0200 5.5162 2.1019 2.0994 2.0604 3.0454 3.0831 3.6212 3.9268 3.9340 3.9295 3.9567 3.8411 3.7350 4.1029 4.0963 3.9307 3.9290 3.8174 3.9139 1.0109 1.0125 1.0027 1.0164 1.0025 1.0028 1.0031 1.0183 1.0023 1.0083 1.0129 0.9954 1.0057 1.0069 1.0100 1.0070 1.0217 1.0059 0.9926 1.0144 1.0106 1.0156 1.0039
dispcorr: -0.021475783 hartree
energy: -1584.207050701533
dipole: -18.36461 18.65256 0.28796 7.07091 -6.91530 0.15561 -15.31724 13.58925 -1.72800
magnitude: 1.75872 au
magnitude: 4.47032 debye
