program: Orca
programVersion: 5.0.2
elementType: S P O O O N N C C C C C C C C C C C C C H H H H H H H H H H H H H H H H H H H H H H H
charge: 0
multiplicity: 1
keywords: wb97x-d3
keywords: def2-TZVPP
keywords: def2/J RIJCOSX
keywords: DEFGRID2
keywords: scfconv7
keywords: smallprint printgap noloewdin
keywords: NOSOSCF
formula: C13H23N2O3PS
InChI: InChI=1/C13H23N2O3PS/c1-7-16-19(20,17-10(2)3)18-11-8-14-12(15-9-11)13(4,5)6/h8-10H,7H2,1-6H3
43 atoms
S  3.719401 -0.610985 1.323578
P  2.246812 -0.271678 0.147869
O  2.057998 1.180838 -0.460255
O  0.863696 -0.591522 0.946028
O  2.170577 -1.085182 -1.215067
N  -2.127118 0.088334 -1.027126
N  -2.69498 -0.35773 1.201997
C  -4.475848 0.144775 -0.414075
C  -4.659837 1.569002 -0.950275
C  -5.39399 -0.054903 0.788046
C  -4.858572 -0.86375 -1.503608
C  -3.017032 -0.05459 -0.049578
C  2.178323 2.37858 0.367717
C  -0.423187 -0.388643 0.531501
C  -0.843099 -0.078125 -0.75334
C  -1.413122 -0.519411 1.488533
C  3.473386 3.066875 0.005341
C  0.954291 3.225942 0.113269
C  2.606936 -2.458765 -1.324614
C  1.703638 -3.419209 -0.593516
H  -4.066938 1.744731 -1.847525
H  -4.37521 2.315031 -0.205744
H  -5.707586 1.738004 -1.205557
H  -6.428603 0.103021 0.47833
H  -5.32566 -1.063347 1.196204
H  -5.181781 0.649233 1.592524
H  -4.724873 -1.891276 -1.159896
H  -4.265053 -0.729881 -2.407534
H  -5.9087 -0.739386 -1.774142
H  2.204899 2.083278 1.42019
H  -0.160644 0.038725 -1.585472
H  -1.155293 -0.764834 2.513324
H  3.483319 3.363412 -1.044441
H  3.592323 3.965138 0.610936
H  4.330643 2.420728 0.194755
H  0.884798 3.518549 -0.93529
H  1.014935 4.135361 0.711179
H  0.038518 2.704282 0.392617
H  2.601756 -2.658358 -2.393991
H  3.636304 -2.53414 -0.970697
H  1.763459 -3.303879 0.488864
H  0.664806 -3.307823 -0.904164
H  2.014996 -4.436827 -0.829973
elementType: S P O N C H
totalener: -1584.18460999 hartree
nucrepener: 2018.55692413 hartree
electener: -3602.74153412 hartree
oneelecener: -6185.60666306 hartree
twoeener: 2582.86512893 hartree
cpcmener: -0.02268693 hartree
kineticenergy: 1578.90152790 hartree
xcener: -118.037534746275 hartree
chargesum: 0.0000000
charge: -0.424001 0.682406 -0.347400 -0.313861 -0.331642 -0.396015 -0.351928 0.293799 -0.339197 -0.322839 -0.339538 0.246013 0.160240 0.220345 0.021086 -0.000603 -0.239035 -0.265899 0.031960 -0.246807 0.094353 0.104266 0.096994 0.098721 0.092121 0.091955 0.104323 0.094336 0.097371 0.070779 0.120991 0.135981 0.091523 0.097576 0.083381 0.094131 0.103150 0.099036 0.112207 0.097866 0.084078 0.090723 0.107052
qa: -0.4240 0.6824 -0.3474 -0.3139 -0.3316 -0.3960 -0.3519 0.2938 -0.3392 -0.3228 -0.3395 0.2460 0.1602 0.2203 0.0211 -0.0006 -0.2390 -0.2659 0.0320 -0.2468 0.0944 0.1043 0.0970 0.0987 0.0921 0.0920 0.1043 0.0943 0.0974 0.0708 0.1210 0.1360 0.0915 0.0976 0.0834 0.0941 0.1032 0.0990 0.1122 0.0979 0.0841 0.0907 0.1071
va: 2.0285 5.5333 2.0948 2.0905 2.0917 3.0594 3.0792 3.6285 3.9307 3.9283 3.9305 3.9573 3.8181 3.7026 4.0370 4.0937 3.9277 3.9367 3.8429 3.8946 1.0175 1.0024 1.0030 1.0026 1.0121 1.0124 1.0025 1.0177 1.0029 1.0162 1.0331 1.0093 1.0075 1.0062 1.0198 1.0070 1.0067 1.0013 0.9920 1.0110 1.0165 1.0048 1.0088
dispcorr: -0.021932930 hartree
energy: -1584.206542923650
dipole: -22.57199 22.34952 -0.22248 7.25756 -6.99964 0.25792 -7.53502 6.93808 -0.59694
magnitude: 0.68728 au
magnitude: 1.74693 debye
