program: Orca
programVersion: 5.0.2
elementType: S P O O O N N C C C C C C C C C C C C C H H H H H H H H H H H H H H H H H H H H H H H
charge: 0
multiplicity: 1
keywords: wb97x-d3
keywords: def2-TZVPP
keywords: def2/J RIJCOSX
keywords: DEFGRID2
keywords: scfconv7
keywords: smallprint printgap noloewdin
keywords: NOSOSCF
formula: C13H23N2O3PS
InChI: InChI=1/C13H23N2O3PS/c1-7-16-19(20,17-10(2)3)18-11-8-14-12(15-9-11)13(4,5)6/h8-10H,7H2,1-6H3
43 atoms
S  1.463728 -1.271492 1.9338
P  1.946542 -0.373817 0.314021
O  2.368709 1.135377 0.522254
O  0.768593 -0.339527 -0.820412
O  3.131559 -0.965943 -0.559135
N  -2.790997 -0.645162 -1.135002
N  -2.344214 0.868121 0.601379
C  -4.663269 0.40452 0.058378
C  -5.51871 -0.33981 -0.962436
C  -4.975682 1.902413 -0.029475
C  -5.004344 -0.106455 1.463304
C  -3.181644 0.191432 -0.182275
C  2.701799 2.039271 -0.582872
C  -0.555843 -0.147771 -0.551758
C  -1.489371 -0.818403 -1.31556
C  -1.045416 0.709468 0.4217
C  1.770729 3.225107 -0.492385
C  4.160667 2.407559 -0.452386
C  3.22706 -2.382435 -0.847255
C  4.295814 -3.016809 0.003185
H  -5.321336 -0.00984 -1.982827
H  -6.572987 -0.149049 -0.754657
H  -5.366771 -1.418354 -0.922274
H  -4.726144 2.303668 -1.013723
H  -6.041166 2.070469 0.136772
H  -4.428565 2.476218 0.717666
H  -4.782314 -1.170692 1.564344
H  -6.068731 0.0313 1.662479
H  -4.450463 0.428567 2.234637
H  2.540425 1.527068 -1.534056
H  -1.176927 -1.503678 -2.096353
H  -0.390244 1.284237 1.066741
H  1.88935 3.752486 0.455192
H  1.997465 3.924263 -1.297225
H  0.72758 2.925116 -0.597885
H  4.358845 2.917267 0.491352
H  4.437387 3.081096 -1.263472
H  4.801755 1.528532 -0.517157
H  2.262484 -2.870503 -0.694301
H  3.467528 -2.452264 -1.906801
H  5.263648 -2.539418 -0.150457
H  4.043593 -2.967904 1.062257
H  4.393315 -4.067347 -0.271778
elementType: S P O N C H
totalener: -1584.18601976 hartree
nucrepener: 1998.98121223 hartree
electener: -3583.16723199 hartree
oneelecener: -6146.82492428 hartree
twoeener: 2563.65769229 hartree
cpcmener: -0.02524239 hartree
kineticenergy: 1578.91092697 hartree
xcener: -118.037500969445 hartree
chargesum: 0.0000000
charge: -0.425895 0.714850 -0.353209 -0.331847 -0.333644 -0.353625 -0.394729 0.299051 -0.325388 -0.338906 -0.340778 0.245210 0.152277 0.260810 -0.015276 -0.001954 -0.257160 -0.256205 0.034452 -0.234675 0.094854 0.099113 0.090914 0.104164 0.096715 0.093834 0.104660 0.097406 0.094974 0.080302 0.138949 0.120480 0.092977 0.102546 0.099648 0.090866 0.097585 0.092803 0.092001 0.110080 0.091052 0.075012 0.095707
qa: -0.4259 0.7148 -0.3532 -0.3318 -0.3336 -0.3536 -0.3947 0.2991 -0.3254 -0.3389 -0.3408 0.2452 0.1523 0.2608 -0.0153 -0.0020 -0.2572 -0.2562 0.0345 -0.2347 0.0949 0.0991 0.0909 0.1042 0.0967 0.0938 0.1047 0.0974 0.0950 0.0803 0.1389 0.1205 0.0930 0.1025 0.0996 0.0909 0.0976 0.0928 0.0920 0.1101 0.0911 0.0750 0.0957
va: 2.0154 5.5140 2.0942 2.0659 2.0952 3.0783 3.0619 3.6169 3.9278 3.9282 3.9332 3.9581 3.8272 3.6639 4.1075 4.0847 3.9176 3.9327 3.8532 3.9320 1.0107 1.0028 1.0129 1.0024 1.0032 1.0194 1.0026 1.0025 1.0160 1.0098 1.0074 1.0268 1.0075 1.0070 1.0029 1.0064 1.0052 1.0142 1.0045 0.9960 1.0039 1.0180 1.0079
dispcorr: -0.021069604 hartree
energy: -1584.207089364194
dipole: -10.48411 11.84860 1.36448 8.51160 -8.06147 0.45013 -5.82503 3.77373 -2.05130
magnitude: 2.50445 au
magnitude: 6.36580 debye
