program: Orca
programVersion: 5.0.2
elementType: S P O O O N N C C C C C C C C C C C C C H H H H H H H H H H H H H H H H H H H H H H H
charge: 0
multiplicity: 1
keywords: wb97x-d3
keywords: def2-TZVPP
keywords: def2/J RIJCOSX
keywords: DEFGRID2
keywords: scfconv7
keywords: smallprint printgap noloewdin
keywords: NOSOSCF
formula: C13H23N2O3PS
InChI: InChI=1/C13H23N2O3PS/c1-7-16-19(20,17-10(2)3)18-11-8-14-12(15-9-11)13(4,5)6/h8-10H,7H2,1-6H3
43 atoms
S  3.539398 -0.529282 1.601653
P  1.941906 -0.320414 0.569721
O  1.950868 0.760356 -0.596961
O  0.673196 0.091357 1.502597
O  1.349404 -1.601154 -0.162913
N  -2.655312 -1.047473 0.694423
N  -2.392316 1.139763 -0.121856
C  -4.517819 -0.033945 -0.485384
C  -4.934946 1.270822 -1.157586
C  -5.482044 -0.330175 0.669156
C  -4.590588 -1.168834 -1.513638
C  -3.103827 0.035291 0.057573
C  2.867743 1.886633 -0.667084
C  -0.606022 0.080056 0.993218
C  -1.419735 -1.028269 1.156686
C  -1.149253 1.167362 0.34315
C  2.894094 2.312355 -2.116658
C  2.419502 2.988396 0.267641
C  2.191481 -2.591068 -0.793688
C  2.907025 -2.068492 -2.015635
H  -5.958031 1.173721 -1.524424
H  -4.302809 1.516853 -2.010597
H  -4.91266 2.114044 -0.467089
H  -5.259168 -1.280986 1.151743
H  -5.444535 0.452919 1.428818
H  -6.505862 -0.379578 0.294502
H  -5.601354 -1.238012 -1.919471
H  -4.343004 -2.133326 -1.070941
H  -3.909271 -0.993874 -2.348643
H  3.857215 1.529969 -0.369315
H  -1.061911 -1.90986 1.677782
H  -0.582879 2.081058 0.199988
H  3.206855 1.493397 -2.765055
H  1.914448 2.663285 -2.444291
H  3.603332 3.129329 -2.243355
H  1.4262 3.354464 0.003619
H  3.116135 3.824158 0.197677
H  2.406626 2.660964 1.307868
H  2.899642 -2.974667 -0.057164
H  1.509835 -3.396762 -1.057563
H  3.669455 -1.330372 -1.766645
H  3.410121 -2.904071 -2.502648
H  2.213333 -1.632399 -2.733872
elementType: S P O N C H
totalener: -1584.18496483 hartree
nucrepener: 2019.65302898 hartree
electener: -3603.83799381 hartree
oneelecener: -6188.23735895 hartree
twoeener: 2584.39936514 hartree
cpcmener: -0.02320674 hartree
kineticenergy: 1578.91960249 hartree
xcener: -118.039677616630 hartree
chargesum: 0.0000000
charge: -0.427293 0.717009 -0.340733 -0.363514 -0.331185 -0.395319 -0.357472 0.294242 -0.325300 -0.338765 -0.340045 0.252607 0.151038 0.225497 -0.006390 0.006641 -0.249355 -0.265676 0.025856 -0.239692 0.099668 0.092892 0.092811 0.094795 0.104373 0.096971 0.097290 0.094839 0.105146 0.079609 0.142085 0.148479 0.097866 0.091800 0.093972 0.094242 0.112170 0.091252 0.094484 0.109062 0.079101 0.102281 0.092660
qa: -0.4273 0.7170 -0.3407 -0.3635 -0.3312 -0.3953 -0.3575 0.2942 -0.3253 -0.3388 -0.3400 0.2526 0.1510 0.2255 -0.0064 0.0066 -0.2494 -0.2657 0.0259 -0.2397 0.0997 0.0929 0.0928 0.0948 0.1044 0.0970 0.0973 0.0948 0.1051 0.0796 0.1421 0.1485 0.0979 0.0918 0.0940 0.0942 0.1122 0.0913 0.0945 0.1091 0.0791 0.1023 0.0927
va: 2.0167 5.5031 2.0641 2.0978 2.1020 3.0481 3.0895 3.6185 3.9271 3.9310 3.9338 3.9583 3.7934 3.7183 4.1212 4.0964 3.9398 3.9103 3.8635 3.8909 1.0026 1.0121 1.0117 1.0184 1.0023 1.0028 1.0029 1.0173 1.0022 1.0222 1.0083 1.0029 1.0050 1.0055 1.0061 1.0026 1.0086 1.0198 1.0079 0.9909 1.0138 1.0099 1.0056
dispcorr: -0.021649692 hartree
energy: -1584.206614524952
dipole: -15.63351 16.11791 0.48440 5.84610 -5.58214 0.26395 -18.80881 17.26395 -1.54486
magnitude: 1.64040 au
magnitude: 4.16956 debye
