program: Orca
programVersion: 5.0.2
elementType: S P O O O N N C C C C C C C C C C C C C H H H H H H H H H H H H H H H H H H H H H H H
charge: 0
multiplicity: 1
keywords: wb97x-d3
keywords: def2-TZVPP
keywords: def2/J RIJCOSX
keywords: DEFGRID2
keywords: scfconv7
keywords: smallprint printgap noloewdin
keywords: NOSOSCF
formula: C13H23N2O3PS
InChI: InChI=1/C13H23N2O3PS/c1-7-16-19(20,17-10(2)3)18-11-8-14-12(15-9-11)13(4,5)6/h8-10H,7H2,1-6H3
43 atoms
S  1.816465 0.077564 1.862155
P  1.967127 0.082113 -0.051142
O  3.197888 0.83646 -0.704533
O  0.744525 0.821563 -0.83994
O  1.990154 -1.323098 -0.791191
N  -2.538854 0.77652 0.662651
N  -2.432424 -0.890732 -0.990661
C  -4.503325 -0.633203 0.247474
C  -5.30725 -0.594263 -1.056455
C  -5.169473 0.284959 1.267861
C  -4.487313 -2.064967 0.797128
C  -3.074519 -0.215505 -0.038101
C  3.863661 1.973048 -0.08091
C  -0.548253 0.455855 -0.559574
C  -1.281201 1.110087 0.408476
C  -1.179446 -0.562272 -1.251062
C  5.198342 2.113646 -0.774296
C  3.008239 3.215768 -0.192202
C  2.26369 -2.577582 -0.127808
C  0.981064 -3.273645 0.247532
H  -5.316355 0.408288 -1.488537
H  -6.342186 -0.880529 -0.861852
H  -4.907784 -1.280326 -1.802134
H  -5.204866 1.319623 0.925725
H  -6.197809 -0.043962 1.427348
H  -4.666304 0.267479 2.234452
H  -5.50512 -2.389993 1.020093
H  -3.908003 -2.132489 1.71994
H  -4.063682 -2.768442 0.0805
H  4.023064 1.728343 0.972388
H  -0.852235 1.927611 0.977257
H  -0.667494 -1.110206 -2.034748
H  5.762943 2.921408 -0.309284
H  5.7899 1.202543 -0.686688
H  5.077427 2.353649 -1.831519
H  3.550112 4.063148 0.228052
H  2.074454 3.12291 0.363503
H  2.775198 3.4467 -1.232308
H  2.838494 -3.162112 -0.844013
H  2.892563 -2.410375 0.747747
H  1.21574 -4.239887 0.694367
H  0.410239 -2.69738 0.975837
H  0.354615 -3.452501 -0.626281
elementType: S P O N C H
totalener: -1584.18598594 hartree
nucrepener: 2015.04829413 hartree
electener: -3599.23428006 hartree
oneelecener: -6179.34439457 hartree
twoeener: 2580.11011450 hartree
cpcmener: -0.02141257 hartree
kineticenergy: 1578.92841682 hartree
xcener: -118.041487003883 hartree
chargesum: -0.0000000
charge: -0.446619 0.760470 -0.349885 -0.356948 -0.358917 -0.350830 -0.391769 0.293560 -0.338175 -0.321346 -0.340843 0.253232 0.140231 0.242598 -0.003386 -0.023272 -0.248742 -0.239751 0.056207 -0.251910 0.104261 0.096624 0.093851 0.094226 0.098778 0.090502 0.098045 0.105766 0.095521 0.074883 0.139681 0.146867 0.091179 0.097640 0.090918 0.101066 0.082790 0.094083 0.109887 0.089903 0.110138 0.079573 0.089913
qa: -0.4466 0.7605 -0.3499 -0.3569 -0.3589 -0.3508 -0.3918 0.2936 -0.3382 -0.3213 -0.3408 0.2532 0.1402 0.2426 -0.0034 -0.0233 -0.2487 -0.2398 0.0562 -0.2519 0.1043 0.0966 0.0939 0.0942 0.0988 0.0905 0.0980 0.1058 0.0955 0.0749 0.1397 0.1469 0.0912 0.0976 0.0909 0.1011 0.0828 0.0941 0.1099 0.0899 0.1101 0.0796 0.0899
va: 1.9749 5.5031 2.1340 2.0781 2.1041 3.0792 3.0383 3.6253 3.9291 3.9266 3.9337 3.9570 3.8342 3.7045 4.1081 4.1180 3.9312 3.8823 3.8263 3.9095 1.0026 1.0032 1.0194 1.0111 1.0027 1.0135 1.0027 1.0026 1.0157 1.0212 1.0094 1.0084 1.0050 1.0087 1.0065 1.0077 1.0191 1.0090 0.9959 1.0140 1.0087 1.0144 1.0028
dispcorr: -0.021361156 hartree
energy: -1584.207347093415
dipole: -12.63153 13.91007 1.27855 -3.36446 3.21531 -0.14914 0.34045 -0.83326 -0.49281
magnitude: 1.37833 au
magnitude: 3.50343 debye
