program: Orca
programVersion: 5.0.2
elementType: S P O O O N N C C C C C C C C C C C C C H H H H H H H H H H H H H H H H H H H H H H H
charge: 0
multiplicity: 1
keywords: wb97x-d3
keywords: def2-TZVPP
keywords: def2/J RIJCOSX
keywords: DEFGRID2
keywords: scfconv7
keywords: smallprint printgap noloewdin
keywords: NOSOSCF
formula: C13H23N2O3PS
InChI: InChI=1/C13H23N2O3PS/c1-7-16-19(20,17-10(2)3)18-11-8-14-12(15-9-11)13(4,5)6/h8-10H,7H2,1-6H3
43 atoms
S  1.822791 -0.002251 1.893787
P  1.953364 0.116811 -0.017236
O  3.183088 0.905246 -0.631475
O  0.723635 0.893928 -0.755069
O  1.96864 -1.241617 -0.840212
N  -2.427081 -0.83828 -1.124224
N  -2.561283 0.618834 0.716111
C  -4.514295 -0.708761 0.156511
C  -5.002207 -1.739821 -0.856578
C  -5.410419 0.532115 0.074158
C  -4.602525 -1.311112 1.563648
C  -3.080873 -0.292545 -0.107174
C  3.834698 2.026242 0.034125
C  -0.563278 0.474427 -0.52474
C  -1.171364 -0.462998 -1.332102
C  -1.313998 1.001269 0.511755
C  5.172682 2.199186 -0.645477
C  2.969394 3.264739 -0.043826
C  2.295956 -2.523853 -0.258852
C  1.042607 -3.255024 0.148076
H  -6.034599 -2.008682 -0.626882
H  -4.410979 -2.65533 -0.830504
H  -4.982381 -1.356119 -1.87681
H  -5.133092 1.28318 0.813086
H  -5.358962 0.994441 -0.913581
H  -6.449717 0.253045 0.256221
H  -5.627536 -1.623728 1.770491
H  -4.312441 -0.594147 2.331263
H  -3.961411 -2.189308 1.661453
H  3.988324 1.747282 1.079625
H  -0.648025 -0.907887 -2.171118
H  -0.900076 1.753309 1.174548
H  5.771836 1.290782 -0.586447
H  5.056267 2.47595 -1.694295
H  5.726857 2.995081 -0.148615
H  2.742505 3.526456 -1.078044
H  3.502536 4.102175 0.406197
H  2.032506 3.148231 0.501883
H  2.835936 -3.06188 -1.035884
H  2.97104 -2.391695 0.587754
H  0.510655 -2.725378 0.938702
H  0.367306 -3.391842 -0.696785
H  1.311804 -4.242028 0.525211
elementType: S P O N C H
totalener: -1584.18602946 hartree
nucrepener: 2014.06851207 hartree
electener: -3598.25454153 hartree
oneelecener: -6177.40273369 hartree
twoeener: 2579.14819216 hartree
cpcmener: -0.02119765 hartree
kineticenergy: 1578.92841093 hartree
xcener: -118.041194549222 hartree
chargesum: -0.0000000
charge: -0.445876 0.760013 -0.349203 -0.355911 -0.358699 -0.348153 -0.394636 0.297823 -0.326723 -0.338918 -0.340401 0.252026 0.138707 0.240318 -0.014977 -0.005984 -0.248249 -0.239973 0.055583 -0.253073 0.099161 0.093087 0.093200 0.093922 0.104553 0.097241 0.097647 0.094919 0.105244 0.074762 0.144307 0.139533 0.097900 0.090790 0.091010 0.094059 0.100886 0.083924 0.109622 0.091043 0.079624 0.091067 0.108803
qa: -0.4459 0.7600 -0.3492 -0.3559 -0.3587 -0.3482 -0.3946 0.2978 -0.3267 -0.3389 -0.3404 0.2520 0.1387 0.2403 -0.0150 -0.0060 -0.2482 -0.2400 0.0556 -0.2531 0.0992 0.0931 0.0932 0.0939 0.1046 0.0972 0.0976 0.0949 0.1052 0.0748 0.1443 0.1395 0.0979 0.0908 0.0910 0.0941 0.1009 0.0839 0.1096 0.0910 0.0796 0.0911 0.1088
va: 1.9763 5.5052 2.1354 2.0798 2.1040 3.0626 3.0545 3.6180 3.9297 3.9319 3.9330 3.9578 3.8369 3.7055 4.0984 4.1240 3.9300 3.8819 3.8284 3.9075 1.0027 1.0118 1.0117 1.0182 1.0022 1.0029 1.0028 1.0172 1.0023 1.0215 1.0105 1.0103 1.0088 1.0066 1.0051 1.0090 1.0077 1.0188 0.9960 1.0130 1.0157 1.0028 1.0090
dispcorr: -0.021254426 hartree
energy: -1584.207283885171
dipole: -12.56387 13.84518 1.28131 -3.20847 3.18616 -0.02231 0.03850 -0.50947 -0.47097
magnitude: 1.36531 au
magnitude: 3.47034 debye
