program: Orca
programVersion: 5.0.2
elementType: S P O O O N N C C C C C C C C C C C C C H H H H H H H H H H H H H H H H H H H H H H H
charge: 0
multiplicity: 1
keywords: wb97x-d3
keywords: def2-TZVPP
keywords: def2/J RIJCOSX
keywords: DEFGRID2
keywords: scfconv7
keywords: smallprint printgap noloewdin
keywords: NOSOSCF
formula: C13H23N2O3PS
InChI: InChI=1/C13H23N2O3PS/c1-7-16-19(20,17-10(2)3)18-11-8-14-12(15-9-11)13(4,5)6/h8-10H,7H2,1-6H3
43 atoms
S  1.832311 0.544157 1.930597
P  1.954452 0.175885 0.052191
O  3.197559 0.747235 -0.744533
O  0.740794 0.783705 -0.856076
O  1.939326 -1.342867 -0.404979
N  -2.371583 -1.043312 -1.020847
N  -2.586123 0.695935 0.545796
C  -4.487328 -0.769603 0.187721
C  -4.563151 -1.166898 1.666939
C  -4.932572 -1.952623 -0.667128
C  -5.422886 0.416039 -0.074365
C  -3.063556 -0.354119 -0.122797
C  3.883716 1.983753 -0.399046
C  -0.547894 0.390237 -0.597481
C  -1.118809 -0.677657 -1.257622
C  -1.339631 1.066358 0.314188
C  5.218837 1.934145 -1.104525
C  3.048907 3.179693 -0.801406
C  2.088292 -2.465859 0.491509
C  0.747584 -2.953346 0.977009
H  -5.574339 -1.494607 1.914276
H  -4.313448 -0.333554 2.323269
H  -3.882851 -1.990455 1.892352
H  -4.315311 -2.835809 -0.502775
H  -5.959344 -2.217126 -0.408492
H  -4.911644 -1.721694 -1.732462
H  -5.372456 0.740731 -1.115514
H  -5.184412 1.270941 0.557363
H  -6.454984 0.127667 0.132531
H  4.039457 1.986465 0.682807
H  -0.56485 -1.241835 -1.99984
H  -0.959825 1.927892 0.85223
H  5.097141 1.929439 -2.188752
H  5.800645 2.815451 -0.836487
H  5.793178 1.054621 -0.81358
H  2.814853 3.15846 -1.866555
H  3.607993 4.092937 -0.597961
H  2.116807 3.238931 -0.238536
H  2.59783 -3.229417 -0.09362
H  2.736316 -2.194281 1.325804
H  0.095173 -3.228781 0.148241
H  0.896238 -3.840247 1.593985
H  0.244054 -2.202591 1.586208
elementType: S P O N C H
totalener: -1584.18592058 hartree
nucrepener: 2018.54664911 hartree
electener: -3602.73256968 hartree
oneelecener: -6186.29938943 hartree
twoeener: 2583.56681974 hartree
cpcmener: -0.02103150 hartree
kineticenergy: 1578.93513916 hartree
xcener: -118.043054484513 hartree
chargesum: 0.0000000
charge: -0.445227 0.757806 -0.347658 -0.355530 -0.357368 -0.346252 -0.394738 0.298303 -0.340360 -0.326632 -0.338363 0.252577 0.136263 0.249223 -0.027700 -0.008435 -0.248595 -0.241562 0.053116 -0.252594 0.097413 0.094668 0.105436 0.092979 0.098815 0.093790 0.104320 0.093963 0.097221 0.075113 0.145545 0.138939 0.090894 0.091310 0.098172 0.093917 0.101079 0.084967 0.110790 0.092538 0.091660 0.110607 0.079591
qa: -0.4452 0.7578 -0.3477 -0.3555 -0.3574 -0.3463 -0.3947 0.2983 -0.3404 -0.3266 -0.3384 0.2526 0.1363 0.2492 -0.0277 -0.0084 -0.2486 -0.2416 0.0531 -0.2526 0.0974 0.0947 0.1054 0.0930 0.0988 0.0938 0.1043 0.0940 0.0972 0.0751 0.1455 0.1389 0.0909 0.0913 0.0982 0.0939 0.1011 0.0850 0.1108 0.0925 0.0917 0.1106 0.0796
va: 1.9790 5.5077 2.1383 2.0755 2.1041 3.0546 3.0536 3.6168 3.9348 3.9306 3.9310 3.9557 3.8419 3.6929 4.0916 4.1274 3.9298 3.8782 3.8284 3.9038 1.0031 1.0165 1.0022 1.0117 1.0031 1.0111 1.0024 1.0185 1.0030 1.0205 1.0105 1.0116 1.0065 1.0051 1.0087 1.0092 1.0078 1.0199 0.9950 1.0130 1.0032 1.0091 1.0146
dispcorr: -0.021586530 hartree
energy: -1584.207507106978
dipole: -13.07316 14.25184 1.17867 -4.12366 3.92800 -0.19566 -0.12622 -0.30629 -0.43251
magnitude: 1.27068 au
magnitude: 3.22980 debye
