program: Orca
programVersion: 5.0.2
elementType: S P O O O N N C C C C C C C C C C C C C H H H H H H H H H H H H H H H H H H H H H H H
charge: 0
multiplicity: 1
keywords: wb97x-d3
keywords: def2-TZVPP
keywords: def2/J RIJCOSX
keywords: DEFGRID2
keywords: scfconv7
keywords: smallprint printgap noloewdin
keywords: NOSOSCF
formula: C13H23N2O3PS
InChI: InChI=1/C13H23N2O3PS/c1-7-16-19(20,17-10(2)3)18-11-8-14-12(15-9-11)13(4,5)6/h8-10H,7H2,1-6H3
43 atoms
S  1.701923 0.03328 1.957696
P  1.834814 -0.13247 0.052425
O  3.026403 0.61333 -0.678646
O  0.5788 0.455916 -0.795858
O  1.902427 -1.597388 -0.560813
N  -2.961836 0.967339 -0.829751
N  -2.54453 -1.012966 0.353043
C  -4.852604 -0.240223 0.126916
C  -5.184687 0.639864 1.34072
C  -5.225345 -1.687954 0.440986
C  -5.668139 0.230327 -1.078828
C  -3.367588 -0.09938 -0.143094
C  3.673921 1.810141 -0.160577
C  -0.738782 0.220492 -0.530126
C  -1.66503 1.127815 -1.017185
C  -1.240998 -0.865916 0.162497
C  5.013261 1.896172 -0.854406
C  2.801793 3.022158 -0.402274
C  2.592756 -2.68293 0.093097
C  4.092435 -2.51944 0.063319
H  -4.625415 0.329025 2.224977
H  -6.247891 0.566753 1.577509
H  -4.958317 1.689961 1.15029
H  -6.30176 -1.758749 0.604945
H  -4.973878 -2.357924 -0.382912
H  -4.730342 -2.05812 1.337278
H  -6.732063 0.099557 -0.874901
H  -5.430106 -0.347968 -1.973538
H  -5.501503 1.282245 -1.30417
H  3.826077 1.669999 0.912645
H  -1.340434 1.998381 -1.577834
H  -0.605289 -1.642858 0.570545
H  5.564147 2.752779 -0.467248
H  5.614117 1.004642 -0.674514
H  4.897499 2.029572 -1.930995
H  3.325525 3.915629 -0.062837
H  1.862463 2.967705 0.149109
H  2.578233 3.144551 -1.462759
H  2.226255 -2.775957 1.11701
H  2.286032 -3.570888 -0.455584
H  4.550523 -3.425814 0.458881
H  4.460613 -2.374511 -0.952057
H  4.429116 -1.686573 0.681321
elementType: S P O N C H
totalener: -1584.18532345 hartree
nucrepener: 1990.47338202 hartree
electener: -3574.65870547 hartree
oneelecener: -6130.12574079 hartree
twoeener: 2555.46703532 hartree
cpcmener: -0.02197920 hartree
kineticenergy: 1578.92438823 hartree
xcener: -118.043197175807 hartree
chargesum: -0.0000000
charge: -0.436946 0.740956 -0.348726 -0.326277 -0.353187 -0.383150 -0.369526 0.274016 -0.340443 -0.318194 -0.323694 0.245169 0.143337 0.245411 -0.011567 0.009564 -0.248363 -0.243033 0.041188 -0.243971 0.103824 0.099913 0.099629 0.098533 0.099473 0.087674 0.097322 0.102080 0.089415 0.075025 0.139527 0.112677 0.093039 0.097783 0.091291 0.101277 0.085081 0.093746 0.094559 0.112218 0.101014 0.093160 0.079176
qa: -0.4369 0.7410 -0.3487 -0.3263 -0.3532 -0.3832 -0.3695 0.2740 -0.3404 -0.3182 -0.3237 0.2452 0.1433 0.2454 -0.0116 0.0096 -0.2484 -0.2430 0.0412 -0.2440 0.1038 0.0999 0.0996 0.0985 0.0995 0.0877 0.0973 0.1021 0.0894 0.0750 0.1395 0.1127 0.0930 0.0978 0.0913 0.1013 0.0851 0.0937 0.0946 0.1122 0.1010 0.0932 0.0792
va: 1.9855 5.5071 2.1243 2.1446 2.0919 3.0633 3.0878 3.6420 3.9334 3.9170 3.9172 3.9615 3.8240 3.7184 4.0975 4.0809 3.9330 3.8924 3.8430 3.9176 1.0054 1.0021 1.0096 1.0031 1.0084 1.0194 1.0035 1.0054 1.0226 1.0209 1.0076 1.0291 1.0054 1.0067 1.0065 1.0080 1.0198 1.0088 1.0088 0.9910 1.0091 1.0057 1.0133
dispcorr: -0.020688007 hartree
energy: -1584.206011460411
dipole: -7.05009 8.83121 1.78112 1.49960 -1.53102 -0.03142 -1.40630 0.88880 -0.51750
magnitude: 1.85504 au
magnitude: 4.71514 debye
