program: Orca
programVersion: 5.0.2
elementType: S P O O O N N C C C C C C C C C C C C C H H H H H H H H H H H H H H H H H H H H H H H
charge: 0
multiplicity: 1
keywords: wb97x-d3
keywords: def2-TZVPP
keywords: def2/J RIJCOSX
keywords: DEFGRID2
keywords: scfconv7
keywords: smallprint printgap noloewdin
keywords: NOSOSCF
formula: C13H23N2O3PS
InChI: InChI=1/C13H23N2O3PS/c1-7-16-19(20,17-10(2)3)18-11-8-14-12(15-9-11)13(4,5)6/h8-10H,7H2,1-6H3
43 atoms
S  2.139919 -0.222369 1.978198
P  2.093791 -0.429719 0.070979
O  2.002919 0.879599 -0.816359
O  0.833683 -1.300196 -0.497503
O  3.288333 -1.215139 -0.618979
N  -2.422019 -0.612695 0.922092
N  -2.279429 0.380705 -1.203408
C  -4.340451 0.645636 0.04752
C  -5.198915 0.026043 -1.061664
C  -4.30255 2.168232 -0.126079
C  -4.964727 0.316132 1.399956
C  -2.929642 0.103463 -0.072935
C  2.095002 2.240035 -0.301531
C  -0.440608 -0.814746 -0.34028
C  -1.183531 -1.072152 0.792557
C  -1.044891 -0.067765 -1.336536
C  2.85374 3.043183 -1.331223
C  0.70068 2.763955 -0.04411
C  4.009964 -2.277398 0.043582
C  3.195248 -3.539203 0.180325
H  -5.239955 -1.06127 -0.972415
H  -4.818187 0.268892 -2.053444
H  -6.221076 0.403192 -0.996047
H  -3.681755 2.640258 0.638092
H  -3.914143 2.457115 -1.101947
H  -5.309843 2.578332 -0.034506
H  -4.400165 0.743658 2.228978
H  -5.045214 -0.757964 1.566773
H  -5.97328 0.731104 1.440583
H  2.657849 2.216426 0.63413
H  -0.781542 -1.667012 1.605009
H  -0.523053 0.157773 -2.260307
H  2.319104 3.081034 -2.281372
H  2.974622 4.06537 -0.973341
H  3.847827 2.631136 -1.504576
H  0.111845 2.796109 -0.961947
H  0.762467 3.778636 0.350017
H  0.171513 2.154905 0.69015
H  4.884347 -2.44399 -0.581951
H  4.354389 -1.92283 1.016628
H  3.833388 -4.322465 0.590184
H  2.353547 -3.414889 0.862135
H  2.82019 -3.883083 -0.783087
elementType: S P O N C H
totalener: -1584.18579151 hartree
nucrepener: 2031.40343714 hartree
electener: -3615.58922865 hartree
oneelecener: -6211.93318470 hartree
twoeener: 2596.34395605 hartree
cpcmener: -0.02095745 hartree
kineticenergy: 1578.92456235 hartree
xcener: -118.041360910968 hartree
chargesum: 0.0000000
charge: -0.446884 0.754881 -0.360159 -0.352699 -0.352110 -0.348572 -0.388797 0.296988 -0.340233 -0.339676 -0.324166 0.248929 0.176240 0.246992 -0.002918 -0.027738 -0.252353 -0.267154 0.030855 -0.235149 0.104374 0.095341 0.097558 0.104077 0.094589 0.097760 0.094360 0.091690 0.099329 0.068152 0.135916 0.146315 0.091056 0.092364 0.097031 0.093442 0.116954 0.087242 0.111903 0.094275 0.100675 0.078277 0.091040
qa: -0.4469 0.7549 -0.3602 -0.3527 -0.3521 -0.3486 -0.3888 0.2970 -0.3402 -0.3397 -0.3242 0.2489 0.1762 0.2470 -0.0029 -0.0277 -0.2524 -0.2672 0.0309 -0.2351 0.1044 0.0953 0.0976 0.1041 0.0946 0.0978 0.0944 0.0917 0.0993 0.0682 0.1359 0.1463 0.0911 0.0924 0.0970 0.0934 0.1170 0.0872 0.1119 0.0943 0.1007 0.0783 0.0910
va: 1.9778 5.5001 2.1155 2.0742 2.1192 3.0775 3.0321 3.6212 3.9317 3.9304 3.9276 3.9608 3.7875 3.6919 4.1090 4.1014 3.9433 3.9008 3.8597 3.8885 1.0026 1.0171 1.0027 1.0024 1.0183 1.0033 1.0111 1.0127 1.0027 1.0260 1.0132 1.0106 1.0065 1.0046 1.0089 1.0052 1.0078 1.0136 0.9918 1.0100 1.0083 1.0168 1.0069
dispcorr: -0.022083293 hartree
energy: -1584.207874805934
dipole: -16.54505 17.53255 0.98750 10.64570 -10.42075 0.22496 -2.98640 2.34359 -0.64281
magnitude: 1.19957 au
magnitude: 3.04906 debye
