program: Gaussian 09
title: 000066615
version: EM64L-G09RevD.01
frameworkgroup: C1[X(C12H18O)]
method: RPBEPBE
basis: SDD
operation: Freq
keyword: #pfreq=noraman
keyword: PBEPBE/SDD
title: #p freq=noraman PBEPBE/SDD
converged: NO YES NO NO
title: Mulliken charges:
elementType: O C C C C C C C C C C C C H H H H H H H H H H H H H H H H H H
charge: -0.296780 0.183692 0.325064 -0.753408 -0.727441 -0.727546 0.207730 -0.373965 -0.536683 0.479545 -0.477200 -0.817996 -0.542083 0.215682 0.214967 0.215004 0.210746 0.199215 0.257502 0.199294 0.210670 0.257423 0.250170 0.236801 0.227196 0.222750 0.231464 0.224450 0.221125 0.221062 0.241553
chargesum: 0.00000
title: Mulliken charges with hydrogens summed into heavy atoms:
elementType: O C C C C C C C C C C C C
charge: -0.296780 0.183692 0.325064 -0.107755 -0.059979 -0.060160 0.207730 -0.123795 -0.299882 0.479545 -0.250005 -0.139332 0.141657
polarizability: 1.67277505e+02 -3.56793086e+00 1.45744554e+02 3.34331956e-01 4.18174415e-02 8.85751001e+01
1716.lowfreq: -11.4071 -0.0008 -0.0005 0.0006 8.4326 13.3116 44.9147 66.8750 88.4582
frequency: 44.7192 66.8671 88.4209 100.1866 182.1223 190.8329 195.5185 214.3180 239.4891 244.8929 273.2708 273.6079 327.9358 331.8954 356.9279 357.8746 392.4623 415.0811 491.0803 494.4457 527.2846 545.6431 598.5540 652.1231 710.2182 747.2346 818.6149 827.5739 853.2940 906.8095 920.1437 929.8096 945.5211 950.5983 991.4241 1014.2642 1020.2477 1031.1928 1045.9779 1074.7963 1110.7092 1148.3137 1157.7558 1175.4799 1204.7667 1219.6263 1250.3415 1267.8043 1295.0318 1366.2564 1367.9473 1370.2159 1393.7193 1396.0750 1403.6557 1440.0465 1454.5845 1465.6863 1468.9637 1472.0824 1472.9594 1474.3078 1474.9701 1478.8917 1488.2773 1502.2877 1506.4280 1581.2638 1618.8814 2956.5010 2971.2225 2973.2102 2973.8839 2978.9064 3043.3452 3051.9382 3060.0173 3063.4421 3070.0357 3074.1004 3083.3519 3107.7747 3111.4397 3117.8265 3126.2225 3143.9303 3167.3111
redmass: 1.0447 2.7345 3.0772 3.2460 3.3648 2.0746 1.1469 2.4931 2.1124 1.1334 2.4568 1.6702 2.9375 1.0621 2.6680 2.6873 2.6489 2.7447 2.8433 3.4700 6.2102 3.5567 3.2953 4.0569 6.0141 3.5282 1.3036 2.6040 1.4823 4.3344 1.7130 1.6891 1.2177 1.3474 2.0472 2.6524 1.4158 1.3784 1.5424 3.5989 1.2597 1.5129 1.4738 1.9155 3.0040 2.2296 3.0371 3.2724 1.4273 5.5692 1.1834 1.2069 1.5300 1.2332 1.8619 1.2356 1.0490 1.0511 1.1487 1.0590 1.0687 1.0888 1.0484 1.0699 1.0520 1.8452 1.2098 5.9252 6.4336 1.0329 1.0352 1.0379 1.0367 1.0374 1.1037 1.0964 1.1001 1.0993 1.0998 1.0984 1.0989 1.0979 1.0971 1.0992 1.0895 1.0899 1.0929
irintensity: 0.3983 0.1981 5.4874 2.3973 1.5277 0.0061 0.1107 0.6332 1.3582 0.0063 0.2603 0.0711 0.4535 0.0387 1.3720 1.5516 0.8698 2.0032 0.1116 2.9313 6.1503 1.5962 9.6165 0.2884 4.3368 0.6198 41.8252 8.0594 9.5181 10.1420 1.4515 4.0325 0.4617 0.8421 13.0752 29.6893 3.2679 0.4165 14.5491 50.6121 0.1858 24.1409 3.2258 60.4019 7.5134 5.2847 52.5681 40.7867 11.8299 10.3583 24.1402 18.0134 26.7920 1.9357 23.6851 6.4809 0.1461 11.1191 64.1971 13.7063 26.3357 3.3853 0.1771 0.8719 10.0792 9.2013 36.8022 21.5674 30.4195 69.2665 23.7702 50.6477 44.8707 48.1774 43.4144 24.5552 9.6439 17.1877 51.6170 96.0518 20.1929 0.5820 28.8037 24.2994 15.2081 15.6177 13.2519
temp: 298.150 k
press: 1.00000 atm
elementType: 8 6 6 6 6 6 6 6 6 6 6 6 6 1 1 1 1 1 1 1 1 1 1 1 1 1 1 1 1 1 1
symmnumber: 1
zpe: 702776.5 jmol-1
zpe.correction: 0.267673 hartree
zpe.thermalcorrener: 0.282178 hartree
zpe.thermalcorrenthalpy: 0.283123 hartree
zpe.thermalcorrgfe: 0.227266 hartree
zpe.sumelectzpe: -542.283702 hartree
zpe.sumelectthermal: -542.269197 hartree
zpe.sumelectthermalent: -542.268253 hartree
zpe.sumelectthermalfe: -542.324109 hartree
dipole: 1.3909 1.3281 0.0413
dipole: 1.9235
quadrupole: -75.2213 -70.2178 -83.8261
quadrupole: 3.2381 0.1452 -0.0244
quadrupole: 1.2004 6.2039 -7.4043 3.2381 0.1452 -0.0244
hfenergy: -542.5513753 hartree
pointgroup: C01 [X(C12H18O1)]
dipole: 0.5339779 -0.5358592 -0.0208327 debye
polarizability: 167.4326605|3.0320991|145.580815|-0.8711341|0.124315|88.5836839 unknown
InChI: InChI=1S/C12H18O/c1-9-6-7-10(12(2,3)4)11(8-9)13-5/h6-8H,1-5H3
charge 0 multiplicity 1
31 atoms
O  -0.398848 -1.962437 0.002779
C  -2.022622 0.448865 0.015853
C  -0.472553 0.461196 0.00785
C  -2.612466 1.885016 0.022832
C  -2.544831 -0.277171 1.293935
C  -2.558201 -0.269836 -1.260695
C  0.311127 -0.741025 0.000823
C  0.261558 1.670658 0.009675
C  1.724465 -0.705604 -0.004384
C  2.42942 0.523897 -0.005344
C  1.675541 1.715902 0.005129
C  3.948534 0.542022 -0.034851
C  0.365668 -3.208486 -0.001726
H  -3.71577 1.818197 0.025557
H  -2.310302 2.453176 0.922182
H  -2.31507 2.460078 -0.873754
H  -2.203523 0.247375 2.205773
H  -3.651581 -0.284933 1.295856
H  -2.187119 -1.317738 1.33408
H  -3.664949 -0.279077 -1.250454
H  -2.227848 0.260916 -2.1730
H  -2.1997 -1.309663 -1.311332
H  -0.283231 2.618371 0.017961
H  2.2983 -1.638268 -0.007468
H  2.187584 2.6851 0.009906
H  4.378245 -0.186587 0.676984
H  4.33336 0.282498 -1.040245
H  4.341889 1.540448 0.222747
H  1.002987 -3.297295 0.899839
H  0.996101 -3.295129 -0.90833
H  -0.390265 -4.008067 0.000221
