program: Orca
programVersion: 5.0.2
elementType: S P O O O N N C C C C C C C C C C C C C H H H H H H H H H H H H H H H H H H H H H H H
charge: 0
multiplicity: 1
keywords: wb97x-d3
keywords: def2-TZVPP
keywords: def2/J RIJCOSX
keywords: DEFGRID2
keywords: scfconv7
keywords: smallprint printgap noloewdin
keywords: NOSOSCF
formula: C13H23N2O3PS
InChI: InChI=1/C13H23N2O3PS/c1-7-16-19(20,17-10(2)3)18-11-8-14-12(15-9-11)13(4,5)6/h8-10H,7H2,1-6H3
43 atoms
S  1.903392 0.143742 1.762019
P  1.998465 0.138438 -0.157021
O  3.192924 0.855553 -0.901873
O  0.738517 0.870479 -0.899758
O  2.015305 -1.283712 -0.866357
N  -2.425194 -0.858744 -1.107987
N  -2.484732 0.627518 0.712064
C  -4.450823 -0.724744 0.266507
C  -4.970142 -1.785747 -0.698925
C  -5.364346 0.504045 0.194487
C  -4.469154 -1.292863 1.690372
C  -3.035344 -0.301108 -0.070625
C  3.843656 2.112333 -0.548181
C  -0.538709 0.464698 -0.608068
C  -1.181785 -0.482112 -1.376434
C  -1.24768 1.008431 0.449367
C  2.854117 3.208214 -0.215841
C  4.868413 1.880572 0.540935
C  2.085031 -2.542904 -0.162529
C  0.710792 -3.067435 0.16609
H  -5.986938 -2.06321 -0.415712
H  -4.364968 -2.692317 -0.679539
H  -5.002619 -1.425942 -1.727512
H  -5.06595 1.273783 0.905576
H  -5.359183 0.945397 -0.80406
H  -6.392092 0.217748 0.424883
H  -5.477485 -1.622371 1.94692
H  -4.164471 -0.550019 2.427074
H  -3.804697 -2.154118 1.784034
H  4.360233 2.374883 -1.471226
H  -0.693626 -0.937305 -2.231131
H  -0.809162 1.772724 1.081195
H  2.310142 3.008731 0.708492
H  3.404667 4.138508 -0.075156
H  2.138458 3.36974 -1.021272
H  4.401829 1.656956 1.499511
H  5.467961 2.78321 0.660118
H  5.544768 1.065827 0.282491
H  2.610592 -3.214595 -0.839048
H  2.69075 -2.431458 0.73756
H  0.106387 -3.202763 -0.730818
H  0.811155 -4.0395 0.650221
H  0.179521 -2.405984 0.850965
elementType: S P O N C H
totalener: -1584.18160081 hartree
nucrepener: 2032.97176532 hartree
electener: -3617.15336613 hartree
oneelecener: -6215.25037993 hartree
twoeener: 2598.09701380 hartree
cpcmener: -0.02106197 hartree
kineticenergy: 1578.92889361 hartree
xcener: -118.046168274270 hartree
chargesum: -0.0000000
charge: -0.446445 0.763859 -0.353412 -0.359642 -0.361118 -0.344560 -0.394662 0.301375 -0.327286 -0.340187 -0.340469 0.249895 0.165949 0.252850 -0.032513 -0.007125 -0.274627 -0.275288 0.054446 -0.252895 0.098956 0.093594 0.092779 0.094017 0.104542 0.097325 0.097501 0.094423 0.104945 0.087959 0.148031 0.139106 0.086459 0.105718 0.103736 0.087870 0.102023 0.100812 0.110362 0.091478 0.091278 0.111305 0.077635
qa: -0.4464 0.7639 -0.3534 -0.3596 -0.3611 -0.3446 -0.3947 0.3014 -0.3273 -0.3402 -0.3405 0.2499 0.1659 0.2528 -0.0325 -0.0071 -0.2746 -0.2753 0.0544 -0.2529 0.0990 0.0936 0.0928 0.0940 0.1045 0.0973 0.0975 0.0944 0.1049 0.0880 0.1480 0.1391 0.0865 0.1057 0.1037 0.0879 0.1020 0.1008 0.1104 0.0915 0.0913 0.1113 0.0776
va: 1.9651 5.4957 2.1310 2.0731 2.1032 3.0566 3.0550 3.6146 3.9307 3.9317 3.9339 3.9592 3.8519 3.6846 4.0980 4.1264 3.8856 3.9285 3.8260 3.9078 1.0029 1.0113 1.0118 1.0178 1.0023 1.0029 1.0029 1.0173 1.0023 0.9917 1.0078 1.0107 1.0206 1.0075 1.0114 1.0165 1.0070 1.0075 0.9946 1.0157 1.0024 1.0090 1.0129
dispcorr: -0.022269047 hartree
energy: -1584.203869862177
dipole: -14.40460 15.52415 1.11954 -3.76075 3.82752 0.06678 3.57668 -4.14594 -0.56926
magnitude: 1.25773 au
magnitude: 3.19691 debye
